{"text_format":"1","workbook":"xlsx","n_sheets":37,"sheets":["Contents","Quality Assurance","Ctrl_sheet","Volumes-->","Vol_Consumer","Vol_Consumer_BB_tiers","Vol_acquisition","TV_BB_tiers","Vol_weights","Costs-->","Marketing","Customer_services","Affiliates","Development","Bandwidth_costs","Platform","Telesales","Calls","Line_acquisition","TV","CPE","TSO","MA_data","SG&A_&_MA_calc","BT_Sport","Wholesale_charges","Revenues and WACC-->","Prices","Line_rental","Usage_charges","WACC","Results-->","Ongoing_revenues","Ongoing_costs","Monthly_margin","Upfront_costs","DCF_analysis"],"not_rendered":{"charts":1,"images":1,"macros":1,"external_links":2,"defined_names":23,"comments":0,"pivot_tables":0},"unopened":[],"bounds":{"document_bytes":16777216,"sheet_cells":100000,"rows_first":2000,"rows_last":500,"rows_between":2000,"halvings":0,"cell_chars":16384,"cell_head_chars":4096},"cells_cut":0,"cells_raw":0,"read":"whole","date_system":"1900"}

{"sheet":"Contents","index":0,"n_rows":113,"n_cols":7,"rows_kept":113,"cut":false,"hidden":false,"merged":[]}
[]
[null,null,null,null,null,null,"BT VULA margin model - Final statement"]
[]
["Information"]
[]
["Title ",{"$f":"G2","v":"BT VULA margin model - Final statement"}]
{"$rows_left_out":108}
{"sheet":"Quality Assurance","index":1,"n_rows":27,"n_cols":4,"rows_kept":27,"cut":false,"hidden":true,"merged":[]}
[]
[null,null,null,"Quality Assurance"]
[]
["Workbook QA"]
[]
["Verified by","Enter name of reviewer"]
{"$rows_left_out":22}
{"sheet":"Ctrl_sheet","index":2,"n_rows":32,"n_cols":12,"rows_kept":32,"cut":false,"hidden":false,"merged":[]}
["Control sheet"]
[]
["Test options"]
[null,null,null,null,null,"Summary"]
[null,"Select bundles to include in test","Total mix (dual-play and triple-play)",null,null,null,"Infinity 1","Unlimited Infinity 1","Infinity 2","Infinity 3","Plusnet Fibre","SFBB portfolio"]
[null,null,null,null,null,"Upfront costs",{"$f":"DCF_analysis!C7","v":{"$error":"#VALUE!"}},{"$f":"DCF_analysis!D7","v":{"$error":"#VALUE!"}},{"$f":"DCF_analysis!E7","v":{"$error":"#VALUE!"}},{"$f":"DCF_analysis!F7","v":{"$error":"#VALUE!"}},{"$f":"DCF_analysis!G7","v":{"$error":"#VALUE!"}},{"$f":"DCF_analysis!H7","v":{"$error":"#VALUE!"}}]
{"$rows_left_out":27}
{"sheet":"Volumes-->","index":3,"n_rows":0,"n_cols":0,"rows_kept":0,"cut":false,"hidden":false,"merged":[]}

{"sheet":"Vol_Consumer","index":4,"n_rows":56,"n_cols":12,"rows_kept":56,"cut":false,"hidden":false,"merged":[[5,3,5,7],[5,9,5,11]]}
["BT Consumer volumes"]
[{"$f":"\"This worksheet \"&Contents!B37","v":"This worksheet contains acquisition and base volumes of the main products sold by BT Consumer - Voice, BB and TV."}]
["Source: S26 volumes received 3rd Oct 2013 and 21st Feb 2014"]
[]
["Units - customers 000s"]
[null,null,null,"12/13",null,null,null,null,null,"13/14"]
{"$rows_left_out":51}
{"sheet":"Vol_Consumer_BB_tiers","index":5,"n_rows":124,"n_cols":11,"rows_kept":124,"cut":false,"hidden":false,"merged":[]}
["BT Infinity fibre volumes"]
[{"$f":"\"This worksheet \"&Contents!B38","v":"This worksheet contains acquisition and base volumes for SFBB and SBB products sold by BT Consumer (does not include Plusnet)."}]
["Units - customers"]
["Product tier","BB type",null,"Q1 2012/13","Q2 2012/13","Q3 2012/13","Q4 2012/13",null,"Q1 2013/14","Q2 2013/14","Q3 2013/14"]
["Customer Base"]
["Infinity Trial","Fibre",null,"Removed","Removed","Removed","Removed",null,"Removed","Removed","Removed"]
{"$rows_left_out":119}
{"sheet":"Vol_acquisition","index":6,"n_rows":31,"n_cols":16,"rows_kept":31,"cut":false,"hidden":false,"merged":[]}
["BT Retail acquisition volumes"]
[{"$f":"\"This worksheet \"&Contents!B39","v":"This worksheet contains acquisition volumes of the main products sold by BT Consumer - Voice, BB and TV."}]
["Source: S26 volumes received 18th Sep 2013"]
[]
["Units - customers",null,null,null,null,null,"2012/13",null,null,null,null,"2013/14"]
["Q.15 response - New to BT",null,null,null,null,null,"Q1","Q2","Q3","Q4","Total","Q1","Q2","Q3"]
{"$rows_left_out":26}
{"sheet":"TV_BB_tiers","index":7,"n_rows":23,"n_cols":9,"rows_kept":23,"cut":false,"hidden":false,"merged":[]}
["TV customer base volumes"]
[{"$f":"\"This worksheet \"&Contents!B40","v":"This worksheet contains base volumes for SFBB customers taking BT TV split out by product tier."}]
["Units - customers"]
[null,null,"2012-2013 Year",null,null,null,"2013-2014 Year"]
[null,null,"June '12","Sep '12","Dec '12","Mar '13","June '13","Sep '13","Dec '13"]
[]
{"$rows_left_out":18}
{"sheet":"Vol_weights","index":8,"n_rows":63,"n_cols":7,"rows_kept":63,"cut":false,"hidden":false,"merged":[]}
["SFBB portfolio volume weights"]
[{"$f":"\"This worksheet \"&Contents!B41","v":"This worksheet collects Q3 2013/14 SFBB product tier volume data and calculates the weightings to apply to the portfolio."}]
[" S26 volumes submitted on 20 May 2013 and 24 February 2014"]
[]
[null,null,null,null,"Scenario description","Q3 2013/14 volumes","Q3 2013/14 volumes"]
["Units - customers",null,null,null,null,"Customer base","Quarterly acquisitions"]
{"$rows_left_out":58}
{"sheet":"Costs-->","index":9,"n_rows":0,"n_cols":0,"rows_kept":0,"cut":false,"hidden":false,"merged":[]}

{"sheet":"Marketing","index":10,"n_rows":35,"n_cols":8,"rows_kept":35,"cut":false,"hidden":false,"merged":[]}
["Marketing costs - 2012/13"]
[{"$f":"\"This worksheet \"&Contents!B44","v":"This worksheet contains the totals for each category of marketing spend in 2012/13. Upfront customer acquisition costs are allocated to SFBB customers in this worksheet. Ongoing costs are linked to \"MA_data\" sheet."}]
["Source: S26 data received 10th Sep 2013"]
["Units - £000"]
[]
[null,"Type of cost","Q1","Q2","Q3","Q4","Total"]
{"$rows_left_out":30}
{"sheet":"Customer_services","index":11,"n_rows":33,"n_cols":7,"rows_kept":33,"cut":false,"hidden":false,"merged":[]}
["Customer services costs - 2012/13"]
[{"$f":"\"This worksheet \"&Contents!B45","v":"This worksheet This worksheet contains the totals of each category of customer services costs in 2012/13. Costs per SFBB subscriber are calculated for [Customer service ongoing - type 1]. All other customer service costs linked to MA_data sheet."}]
["Source: S26 data received 10th Sep 2013"]
["Units - £000"]
[null,"Type of cost","BT allocation method","Total Consumer BRF2 12/13","Dual-play allocation","Triple-play allocation","Total mix (dual-play and triple-play)"]
[]
{"$rows_left_out":28}
{"sheet":"Affiliates","index":12,"n_rows":32,"n_cols":3,"rows_kept":32,"cut":false,"hidden":false,"merged":[]}
["Affiliates / pay-per click costs - 2012/13"]
[{"$f":"\"This worksheet \"&Contents!B46","v":"This worksheet collects the total online advertising spend on broadband, calls and TV as calculated in the \"Pay per click\" file and allocates to SFBB on the basis of acquisition volumes"}]
["Source: BT s26 data received 18 October 2013"]
["Units - £"]
[]
["Calculation inputs"]
{"$rows_left_out":27}
{"sheet":"Development","index":13,"n_rows":71,"n_cols":8,"rows_kept":71,"cut":false,"hidden":false,"merged":[]}
["Development spend - 2012/13"]
[{"$f":"\"This worksheet \"&Contents!B47","v":"This worksheet contains the break-down of development spend into different activities. These activities are categorised into broadband (BB), voice, TV and other and a proportion of these costs are allocated to SFBB."}]
["Source: ","S26 data received 10th Sep 2013"]
["Units - £m"]
[]
["Calculation inputs"]
{"$rows_left_out":66}
{"sheet":"Bandwidth_costs","index":14,"n_rows":30,"n_cols":9,"rows_kept":30,"cut":false,"hidden":false,"merged":[]}
["Infinity bandwidth costs"]
[{"$f":"\"This worksheet \"&Contents!B48","v":"This worksheet Calculates 2013/14 network costs on the basis of RFS cost data and actual peak throughput per user data"}]
[]
["2013/14 cost per Mbit/s (£ per month)"]
[]
["RFS Total FAC - Internal WBC Bandwidth Market 3"]
{"$rows_left_out":25}
{"sheet":"Platform","index":15,"n_rows":30,"n_cols":11,"rows_kept":30,"cut":false,"hidden":false,"merged":[]}
["2012/13 Platform costs"]
[{"$f":"\"This worksheet \"&Contents!B49","v":"This worksheet allocates 2012/13 platform costs to individual products based on share of total throughput"}]
["BT response to srd 3135 received 24 June 2013"]
["2012/13 Platform Costs (£)","Removed"]
["Average volumes (2012/13)",{"$f":"AVERAGE(Vol_Consumer!D33:G33)*1000","v":{"$error":"#DIV/0!"}}]
[]
{"$rows_left_out":25}
{"sheet":"Telesales","index":16,"n_rows":31,"n_cols":11,"rows_kept":31,"cut":false,"hidden":false,"merged":[]}
["Telesales - total labour cost (TLC) for 2012/13"]
[{"$f":"\"This worksheet \"&Contents!B50","v":"This worksheet collects 2012/13 data from BT's Total Labour Cost system on telesales spend broken down by activities. This sheet allocates telesales costs to different product lines on the basis of call handling times."}]
["Source: S26 data received on 11th October 2013 ",null,null,null,null,null,null,"Inbound Telesales TLC (£)"]
[null,null,null,null,null,null,null,null,"Q4 12/13 TLR","% split of TLR","2012/13 TLC"]
[null,"Line","CPS","BB","Vision","Total",null,"Removed","Removed",{"$f":"I5/I$10","v":{"$error":"#VALUE!"}},"Removed"]
["Raised Provides (customers)","Removed","Removed","Removed","Removed",{"$f":"SUM(B6:E6)","v":0},null,"Removed","Removed",{"$f":"I6/I$10","v":{"$error":"#VALUE!"}},"Removed"]
{"$rows_left_out":26}
{"sheet":"Calls","index":17,"n_rows":35,"n_cols":6,"rows_kept":35,"cut":false,"hidden":false,"merged":[]}
["Calls costs and revenues -  Infinity Customers"]
[{"$f":"\"This worksheet \"&Contents!B51","v":"This worksheet collects cost and revenue information on BT calls packages bundled with Infinity as recorded in BT's calls database."}]
["Source: s26 data received on 28th Feb 2014 and 4th Mar 2014"]
[]
["Call revenues and costs"]
[null,"Q1 13/14","Q2 13/14","Q3 13/14","Q4 13/14","Q1 14/15"]
{"$rows_left_out":30}
{"sheet":"Line_acquisition","index":18,"n_rows":23,"n_cols":2,"rows_kept":23,"cut":false,"hidden":false,"merged":[]}
["Line acquisition costs"]
[{"$f":"\"This worksheet \"&Contents!B52","v":"This worksheet collects data on customer acquisitions and costs of different kinds of acquisitions (e.g. new lines, takeovers from other CPs) and calculates the average SFBB line acquisition cost."}]
[]
["Openreach charges"]
["Source: BT Model and Openreach price list","January 2015 charges"]
["WLR new connection",-47.11]
{"$rows_left_out":18}
{"sheet":"TV","index":19,"n_rows":51,"n_cols":17,"rows_kept":51,"cut":false,"hidden":false,"merged":[[4,3,4,7],[4,9,4,13]]}
["TV costs and revenues"]
[{"$f":"\"This worksheet \"&Contents!B53","v":"This worksheet summarises TV costs and revenues provided by BT and selects the relevant data for inclusion in the SFBB portfolio cost stack."}]
["Source: S26 data received on 18 October 2013 and 28 February 2014 and 4 March 2014"]
[]
[null,null,null,"2012/13",null,null,null,null,null,"2013/14"]
["TV costs per customer",null,null,"Essentials","Unlimited","Essentials extra","Unlimited extra","Weighted",null,"Essentials","Unlimited","Essentials extra","Unlimited extra","Weighted"]
{"$rows_left_out":46}
{"sheet":"CPE","index":20,"n_rows":14,"n_cols":4,"rows_kept":14,"cut":false,"hidden":false,"merged":[]}
["CPE costs"]
[{"$f":"\"This worksheet \"&Contents!B54","v":"This worksheet calculates cost of Home Hub per SFBB subscriber"}]
["Source: s26 data in 3rd s26 (Q9) received on 4th July 2013 and 6th s26 (Q8) received on 18th October 2013"]
[]
[]
["Hub Variant (forecasts)","FY 13/14 Vol(k)","Total Cost (£k)","Unit Cost (£)"]
{"$rows_left_out":9}
{"sheet":"TSO","index":21,"n_rows":17,"n_cols":15,"rows_kept":17,"cut":false,"hidden":false,"merged":[]}
["TSO costs"]
[{"$f":"\"This worksheet \"&Contents!B55","v":"This worksheet collects TSO spend in 2012/13 broken down into different activities and cost types (e.g. direct, indirect and fixed)."}]
["Source: s26 data in 7th s26 (Q2,3,5,6) received on 6th December 2013"]
[null,"Cost type","Costs (£m)"]
["Removed","Direct","Removed","These are projects and activities allocated in individual management accounts. They are already in our non-SG&A cost stack.",null,null,null,null,null,null,null,null,null,null,"Indirect"]
["Removed","Direct","Removed",null,null,null,null,null,null,null,null,null,null,null,"Fixed"]
{"$rows_left_out":12}
{"sheet":"MA_data","index":22,"n_rows":46,"n_cols":12,"rows_kept":46,"cut":false,"hidden":false,"merged":[]}
["SG&A and management accounts data",null,null,null,null,null,null,null,null,"Short-run variable","Long-run variable","Fixed"]
[{"$f":"\"This worksheet \"&Contents!B56","v":"This worksheet consolidates all relevant data from the BT Consumer management accounts. It also assigns different characteristics to each line item for the purpose of allocating to the SFBB portfolio."}]
["Source: Summary management accounts. Received 25th June 2013.",null,null,null,null,null,null,null,null,"Customers","Products","Revenues"]
["Summary management accounts - TV. Received 2 October 2013"]
["TSO cost breakdown received 29 November 2013"]
["Units - £000s"]
{"$rows_left_out":41}
{"sheet":"SG&A_&_MA_calc","index":23,"n_rows":44,"n_cols":10,"rows_kept":44,"cut":false,"hidden":false,"merged":[]}
["2012/13 SG&A and management accounts data - allocations"]
[{"$f":"\"This worksheet \"&Contents!B57","v":"This worksheet allocates a proportion of BT Consumer SG&A costs and other costs captured in the management accounts to the SFBB portfolio and calculates unit cost"}]
[]
["Calculation inputs"]
["Ongoing costs"]
["Volumes - average of quarterly customer bases in 2012/13"]
{"$rows_left_out":39}
{"sheet":"BT_Sport","index":24,"n_rows":45,"n_cols":2,"rows_kept":45,"cut":false,"hidden":false,"merged":[]}
["BT Sport"]
[{"$f":"Contents!B58","v":"calculates monthly net costs of BT Sport per BT Infinity subscriber."}]
["Source: BT's response 130710 to Q2 of the 4th s26 notice; BT's response 130823 to Q31 of the 5th s26 Notice; BT's response 131028 to Q21, Q24 and Q25 of the 6th s26 Notice; BT's response 131129 to Q11 and Q11A of the 7th s26 Notice; "]
["BT's response 131217 to Q21 of the 7th s26 Notice; BT's response 131217 to Q22 of the 7th s26 Notice; BT's response 131216 to Question 23 of the 7th s26 Notice; BT's response 140110 to Q1 of the 8th s26 notice; "]
["BT's response 140120 to Q1 of the 8th s26 notice; BT's response 140218 to Q19 of the 9th s26 notice; BT’s response 140221 to Q25 of the 9th s26 Notice; BT’s response 140221 to Q26 of the 9th s26 Notice; "]
["BT's response 140228 to Q29 of the 9th s26 Notice; BT's response 28022014 to Q32 of the 9th s26 Notice; BT's response 141021 to Q1 of the 21st s135 notice; BT's follow-up response 141023 to Q1 of the 21st s135 notice; "]
{"$rows_left_out":40}
{"sheet":"Wholesale_charges","index":25,"n_rows":14,"n_cols":4,"rows_kept":14,"cut":false,"hidden":false,"merged":[]}
["Wholesale charges"]
[{"$f":"\"This worksheet \"&Contents!B59","v":"This worksheet collects Openreach charges for wholesale inputs (e.g. GEA, WLR/MPF) and calculates per SFBB customer cost."}]
["Source: ","Openreach price list"]
[]
[]
[null,null,"Jan 2015 charges"]
{"$rows_left_out":9}
{"sheet":"Revenues and WACC-->","index":26,"n_rows":0,"n_cols":0,"rows_kept":0,"cut":false,"hidden":false,"merged":[]}

{"sheet":"Prices","index":27,"n_rows":69,"n_cols":6,"rows_kept":69,"cut":false,"hidden":false,"merged":[]}
["Upfront and ongoing revenues"]
[{"$f":"\"This worksheet \"&Contents!B62","v":"This worksheet collects pricing information on Infinity and Plusnet products and selects the relevant data for inclusion in the test."}]
["Source: ","Openreach price list"]
[null,"http://www.productsandservices.bt.com/products/broadband-packages",null,null,"Removed","Removed"]
[]
[null,null,null,"Scenario description","Jan 2015 prices","BT website accessed 05/01/2015"]
{"$rows_left_out":64}
{"sheet":"Line_rental","index":28,"n_rows":31,"n_cols":2,"rows_kept":31,"cut":false,"hidden":false,"merged":[]}
["Infinity line rental revenues - 2012/13"]
[{"$f":"\"This worksheet \"&Contents!B63","v":"This worksheet collects data on line rental volumes and prices and calculates the average discount per customer resulting from Line Rental Saver."}]
["Source: S26 data received on 26th June 2013"]
[]
["Inputs"]
[]
{"$rows_left_out":26}
{"sheet":"Usage_charges","index":29,"n_rows":41,"n_cols":4,"rows_kept":41,"cut":false,"hidden":false,"merged":[]}
["Out-of-package data usage revenue - 2012/13"]
[{"$f":"\"This worksheet \"&Contents!B64","v":"This worksheet collects monthly usage revenues and customer bases for Infinity 1, as provided by BT, and calculates an average usage revenue per SFBB customer. "}]
["Source: s26 data received on 21 Feb 2014"]
[]
[null,"Average Infinity 1 revenue per customer (£)"]
["2012-04-01","Removed"]
{"$rows_left_out":36}
{"sheet":"WACC","index":30,"n_rows":15,"n_cols":5,"rows_kept":15,"cut":false,"hidden":false,"merged":[]}
["Discount rate - Rest of BT cost of capital"]
[{"$f":"\"This worksheet \"&Contents!B65","v":"This worksheet selects the WACC rate to use to discount ongoing margins. "}]
["Source: 2013 WLR Consultation",null,"http://stakeholders.ofcom.org.uk/binaries/consultations/llu-wlr-cc-13/annexes/annexes.pdf"]
[]
[null,null,"Scenario description","2014 WBA - Nominal","<Add scenario>"]
[]
{"$rows_left_out":10}
{"sheet":"Results-->","index":31,"n_rows":0,"n_cols":0,"rows_kept":0,"cut":false,"hidden":false,"merged":[]}

{"sheet":"Ongoing_revenues","index":32,"n_rows":36,"n_cols":7,"rows_kept":36,"cut":false,"hidden":false,"merged":[]}
["Ongoing revenues (£ per month)"]
[]
[null,"Infinity 1","Unlimited Infinity 1","Infinity 2","Infinity 3","Plusnet Fibre","SFBB portfolio"]
["Volume weights - dual-play",{"$f":"INDEX(Vol_weights!$E$48:$E$52,MATCH(B$3,Vol_weights!$B$48:$B$52,0))","v":{"$error":"#VALUE!"}},{"$f":"INDEX(Vol_weights!$E$48:$E$52,MATCH(C$3,Vol_weights!$B$48:$B$52,0))","v":{"$error":"#VALUE!"}},{"$f":"INDEX(Vol_weights!$E$48:$E$52,MATCH(D$3,Vol_weights!$B$48:$B$52,0))","v":{"$error":"#VALUE!"}},{"$f":"INDEX(Vol_weights!$E$48:$E$52,MATCH(E$3,Vol_weights!$B$48:$B$52,0))","v":{"$error":"#VALUE!"}},{"$f":"INDEX(Vol_weights!$E$48:$E$52,MATCH(F$3,Vol_weights!$B$48:$B$52,0))","v":{"$error":"#VALUE!"}},{"$f":"SUM(B4:F4)","v":{"$error":"#VALUE!"}}]
["Volume weights - triple-play",{"$f":"INDEX(Vol_weights!$E$39:$E$43,MATCH(B3,Vol_weights!$B$39:$B$43,0))","v":{"$error":"#VALUE!"}},{"$f":"INDEX(Vol_weights!$E$39:$E$43,MATCH(C3,Vol_weights!$B$39:$B$43,0))","v":{"$error":"#VALUE!"}},{"$f":"INDEX(Vol_weights!$E$39:$E$43,MATCH(D3,Vol_weights!$B$39:$B$43,0))","v":{"$error":"#VALUE!"}},{"$f":"INDEX(Vol_weights!$E$39:$E$43,MATCH(E3,Vol_weights!$B$39:$B$43,0))","v":{"$error":"#VALUE!"}},{"$f":"INDEX(Vol_weights!$E$39:$E$43,MATCH(F3,Vol_weights!$B$39:$B$43,0))","v":{"$error":"#VALUE!"}},{"$f":"SUM(B5:F5)","v":{"$error":"#VALUE!"}}]
["Monthly revenue - Dual play"]
{"$rows_left_out":31}
{"sheet":"Ongoing_costs","index":33,"n_rows":91,"n_cols":8,"rows_kept":91,"cut":false,"hidden":false,"merged":[]}
["Ongoing costs (£ per month)"]
[null,null,"Infinity 1","Unlimited Infinity 1","Infinity 2","Infinity 3","Plusnet Fibre","SFBB portfolio"]
[null,"Volume weights - dual-play",{"$f":"INDEX(Vol_weights!$E$48:$E$52,MATCH(C$2,Vol_weights!$B$48:$B$52,0))","v":{"$error":"#VALUE!"}},{"$f":"INDEX(Vol_weights!$E$48:$E$52,MATCH(D$2,Vol_weights!$B$48:$B$52,0))","v":{"$error":"#VALUE!"}},{"$f":"INDEX(Vol_weights!$E$48:$E$52,MATCH(E$2,Vol_weights!$B$48:$B$52,0))","v":{"$error":"#VALUE!"}},{"$f":"INDEX(Vol_weights!$E$48:$E$52,MATCH(F$2,Vol_weights!$B$48:$B$52,0))","v":{"$error":"#VALUE!"}},{"$f":"INDEX(Vol_weights!$E$48:$E$52,MATCH(G$2,Vol_weights!$B$48:$B$52,0))","v":{"$error":"#VALUE!"}},{"$f":"SUM(C3:G3)","v":{"$error":"#VALUE!"}}]
[null,"Volume weights - triple-play",{"$f":"INDEX(Vol_weights!$E$39:$E$43,MATCH(C2,Vol_weights!$B$39:$B$43,0))","v":{"$error":"#VALUE!"}},{"$f":"INDEX(Vol_weights!$E$39:$E$43,MATCH(D2,Vol_weights!$B$39:$B$43,0))","v":{"$error":"#VALUE!"}},{"$f":"INDEX(Vol_weights!$E$39:$E$43,MATCH(E2,Vol_weights!$B$39:$B$43,0))","v":{"$error":"#VALUE!"}},{"$f":"INDEX(Vol_weights!$E$39:$E$43,MATCH(F2,Vol_weights!$B$39:$B$43,0))","v":{"$error":"#VALUE!"}},{"$f":"INDEX(Vol_weights!$E$39:$E$43,MATCH(G2,Vol_weights!$B$39:$B$43,0))","v":{"$error":"#VALUE!"}},{"$f":"SUM(C4:G4)","v":{"$error":"#VALUE!"}}]
["Monthly wholesale costs - Dual play"]
[]
{"$rows_left_out":86}
{"sheet":"Monthly_margin","index":34,"n_rows":33,"n_cols":8,"rows_kept":33,"cut":false,"hidden":false,"merged":[]}
["Net margin (£ per month, per customer), excl. upfront costs"]
[null,"Dual play"]
[null,null,"Infinity 1","Unlimited Infinity 1","Infinity 2","Infinity 3","Plusnet Fibre","SFBB portfolio"]
[null,"Revenue",{"$f":"IF(Ongoing_revenues!B4=0,0,Ongoing_revenues!B16)","v":{"$error":"#VALUE!"}},{"$f":"IF(Ongoing_revenues!C4=0,0,Ongoing_revenues!C16)","v":{"$error":"#VALUE!"}},{"$f":"IF(Ongoing_revenues!D4=0,0,Ongoing_revenues!D16)","v":{"$error":"#VALUE!"}},{"$f":"IF(Ongoing_revenues!E4=0,0,Ongoing_revenues!E16)","v":{"$error":"#VALUE!"}},{"$f":"IF(Ongoing_revenues!F4=0,0,Ongoing_revenues!F16)","v":{"$error":"#VALUE!"}},{"$f":"Ongoing_revenues!G16","v":{"$error":"#VALUE!"}}]
[null,"Wholesale costs",{"$f":"IF(Ongoing_costs!C3=0,0,Ongoing_costs!C11)","v":{"$error":"#VALUE!"}},{"$f":"IF(Ongoing_costs!D3=0,0,Ongoing_costs!D11)","v":{"$error":"#VALUE!"}},{"$f":"IF(Ongoing_costs!E3=0,0,Ongoing_costs!E11)","v":{"$error":"#VALUE!"}},{"$f":"IF(Ongoing_costs!F3=0,0,Ongoing_costs!F11)","v":{"$error":"#VALUE!"}},{"$f":"IF(Ongoing_costs!G3=0,0,Ongoing_costs!G11)","v":{"$error":"#VALUE!"}},{"$f":"Ongoing_costs!H11","v":{"$error":"#VALUE!"}}]
[null,"Operating costs",{"$f":"IF(Ongoing_costs!C3=0,0,Ongoing_costs!C36)","v":{"$error":"#VALUE!"}},{"$f":"IF(Ongoing_costs!D3=0,0,Ongoing_costs!D36)","v":{"$error":"#VALUE!"}},{"$f":"IF(Ongoing_costs!E3=0,0,Ongoing_costs!E36)","v":{"$error":"#VALUE!"}},{"$f":"IF(Ongoing_costs!F3=0,0,Ongoing_costs!F36)","v":{"$error":"#VALUE!"}},{"$f":"IF(Ongoing_costs!G3=0,0,Ongoing_costs!G36)","v":{"$error":"#VALUE!"}},{"$f":"Ongoing_costs!H36","v":{"$error":"#VALUE!"}}]
{"$rows_left_out":28}
{"sheet":"Upfront_costs","index":35,"n_rows":60,"n_cols":7,"rows_kept":60,"cut":false,"hidden":false,"merged":[]}
["One-off net costs costs (£ per customer)"]
[null,"Infinity 1","Unlimited Infinity 1","Infinity 2","Infinity 3","Plusnet Fibre","SFBB portfolio"]
["Volume weights - dual-play",{"$f":"INDEX(Vol_weights!$E$48:$E$52,MATCH(B$2,Vol_weights!$B$48:$B$52,0))","v":{"$error":"#VALUE!"}},{"$f":"INDEX(Vol_weights!$E$48:$E$52,MATCH(C$2,Vol_weights!$B$48:$B$52,0))","v":{"$error":"#VALUE!"}},{"$f":"INDEX(Vol_weights!$E$48:$E$52,MATCH(D$2,Vol_weights!$B$48:$B$52,0))","v":{"$error":"#VALUE!"}},{"$f":"INDEX(Vol_weights!$E$48:$E$52,MATCH(E$2,Vol_weights!$B$48:$B$52,0))","v":{"$error":"#VALUE!"}},{"$f":"INDEX(Vol_weights!$E$48:$E$52,MATCH(F$2,Vol_weights!$B$48:$B$52,0))","v":{"$error":"#VALUE!"}},{"$f":"SUM(B3:F3)","v":{"$error":"#VALUE!"}}]
["Volume weights - triple-play",{"$f":"INDEX(Vol_weights!$E$39:$E$43,MATCH(B2,Vol_weights!$B$39:$B$43,0))","v":{"$error":"#VALUE!"}},{"$f":"INDEX(Vol_weights!$E$39:$E$43,MATCH(C2,Vol_weights!$B$39:$B$43,0))","v":{"$error":"#VALUE!"}},{"$f":"INDEX(Vol_weights!$E$39:$E$43,MATCH(D2,Vol_weights!$B$39:$B$43,0))","v":{"$error":"#VALUE!"}},{"$f":"INDEX(Vol_weights!$E$39:$E$43,MATCH(E2,Vol_weights!$B$39:$B$43,0))","v":{"$error":"#VALUE!"}},{"$f":"INDEX(Vol_weights!$E$39:$E$43,MATCH(F2,Vol_weights!$B$39:$B$43,0))","v":{"$error":"#VALUE!"}},{"$f":"SUM(B4:F4)","v":{"$error":"#VALUE!"}}]
["Upfront costs - Dual play"]
[]
{"$rows_left_out":55}
{"sheet":"DCF_analysis","index":36,"n_rows":317,"n_cols":9,"rows_kept":317,"cut":false,"hidden":false,"merged":[]}
["DCF analysis"]
[null,"Selected bundles",{"$f":"Ctrl_sheet!C5","v":"Total mix (dual-play and triple-play)"}]
[null,"Discount rate",{"$f":"WACC!$C$15","v":0.108}]
[]
[null,"Volume weights",{"$f":"IF(Ctrl_sheet!$C$5=\"Dual-play\",INDEX(Vol_weights!$E$48:$E$52,MATCH(C6,Vol_weights!$B$48:$B$52,0)),IF(Ctrl_sheet!$C$5=\"Triple-play\",INDEX(Vol_weights!$E$39:$E$43,MATCH(C6,Vol_weights!$B$39:$B$43,0)),INDEX(Vol_weights!$E$30:$E$34,MATCH(C6,Vol_weights!$B$30:$B$34,0))))","v":{"$error":"#VALUE!"}},{"$f":"IF(Ctrl_sheet!$C$5=\"Dual-play\",INDEX(Vol_weights!$E$48:$E$52,MATCH(D6,Vol_weights!$B$48:$B$52,0)),IF(Ctrl_sheet!$C$5=\"Triple-play\",INDEX(Vol_weights!$E$39:$E$43,MATCH(D6,Vol_weights!$B$39:$B$43,0)),INDEX(Vol_weights!$E$30:$E$34,MATCH(D6,Vol_weights!$B$30:$B$34,0))))","v":{"$error":"#VALUE!"}},{"$f":"IF(Ctrl_sheet!$C$5=\"Dual-play\",INDEX(Vol_weights!$E$48:$E$52,MATCH(E6,Vol_weights!$B$48:$B$52,0)),IF(Ctrl_sheet!$C$5=\"Triple-play\",INDEX(Vol_weights!$E$39:$E$43,MATCH(E6,Vol_weights!$B$39:$B$43,0)),INDEX(Vol_weights!$E$30:$E$34,MATCH(E6,Vol_weights!$B$30:$B$34,0))))","v":{"$error":"#VALUE!"}},{"$f":"IF(Ctrl_sheet!$C$5=\"Dual-play\",INDEX(Vol_weights!$E$48:$E$52,MATCH(F6,Vol_weights!$B$48:$B$52,0)),IF(Ctrl_sheet!$C$5=\"Triple-play\",INDEX(Vol_weights!$E$39:$E$43,MATCH(F6,Vol_weights!$B$39:$B$43,0)),INDEX(Vol_weights!$E$30:$E$34,MATCH(F6,Vol_weights!$B$30:$B$34,0))))","v":{"$error":"#VALUE!"}},{"$f":"IF(Ctrl_sheet!$C$5=\"Dual-play\",INDEX(Vol_weights!$E$48:$E$52,MATCH(G6,Vol_weights!$B$48:$B$52,0)),IF(Ctrl_sheet!$C$5=\"Triple-play\",INDEX(Vol_weights!$E$39:$E$43,MATCH(G6,Vol_weights!$B$39:$B$43,0)),INDEX(Vol_weights!$E$30:$E$34,MATCH(G6,Vol_weights!$B$30:$B$34,0))))","v":{"$error":"#VALUE!"}},{"$f":"SUM(C5:G5)","v":{"$error":"#VALUE!"}}]
[null,null,"Infinity 1","Unlimited Infinity 1","Infinity 2","Infinity 3","Plusnet Fibre","SFBB portfolio"]
{"$rows_left_out":311}