{"text_format":"1","workbook":"xlsx","n_sheets":9,"sheets":["Contents","Version History","Quality Assurance","Style Guidelines","Instructions","Assumptions","Projections","Spectrum Opt","Capacity Model"],"not_rendered":{"charts":5,"images":1,"macros":1,"external_links":0,"defined_names":162,"comments":0,"pivot_tables":0},"unopened":[],"bounds":{"document_bytes":16777216,"sheet_cells":100000,"rows_first":2000,"rows_last":500,"rows_between":2000,"halvings":0,"cell_chars":16384,"cell_head_chars":4096},"cells_cut":0,"cells_raw":0,"read":"whole","date_system":"1900"}

{"sheet":"Contents","index":0,"n_rows":42,"n_cols":6,"rows_kept":42,"cut":false,"hidden":false,"merged":[[25,0,25,3],[41,0,41,3],[29,0,29,3],[31,0,31,3],[33,0,33,3],[35,0,35,3],[37,0,37,3],[39,0,39,3]]}
[]
[null,null,null,null,null,{"$f":"Workbook.Title","v":"MDS Capacity Model"}]
[]
["Information"]
[]
["Title ","MDS Capacity Model"]
["Project case code","1213-PR-001639"]
["Status","Approved for release"]
["Author","Ofcom"]
[]
["Confidentiality status","Approved for release"]
[]
[]
["Contents"]
[]
{"$rows_left_out":28}
{"sheet":"Version History","index":1,"n_rows":6,"n_cols":4,"rows_kept":6,"cut":false,"hidden":true,"merged":[]}
[]
[null,null,null,"Version Histrory"]
[]
["History"]
[]
["Version","Date ","Author","Details of modifications introduced"]

{"sheet":"Quality Assurance","index":2,"n_rows":27,"n_cols":4,"rows_kept":27,"cut":false,"hidden":true,"merged":[]}
[]
[null,null,null,"Quality Assurance"]
[]
["Workbook QA"]
[]
["Verified by","Enter name of reviewer"]
["Date","Enter date review completed"]
["Version","Enter version of workbook checked"]
["Status","QA completed but issues to resolve"]
[]
["Type of QA","Self-check by author","Yes"]
[null,"Internal QA - informal","Yes"]
[null,"Internal QA - formal","Yes"]
[null,"External QA","Yes"]
[]
{"$rows_left_out":13}
{"sheet":"Style Guidelines","index":3,"n_rows":38,"n_cols":8,"rows_kept":38,"cut":false,"hidden":true,"merged":[]}
[]
[null,null,null,null,null,null,null,"Style Guidelines"]
["NB Use Window Unfreeze Panes (on each worksheet) to have row 1 scroll with the rest of the worksheet"]
[]
["Styles"]
[]
[]
[null,"Input",100,null,"An input to the model that it is expected the user will change (change at will)"]
[]
[null,"Output",100,null,"A key result from this part of the model (in particular one that will be used elsewhere in the model)"]
[]
[null,"Highlight",100,null,"A cell that is highlighted for uncertainty"]
[]
[null,"Note or Source","Note",null,"A note (NB smaller than standard font size)"]
[]
{"$rows_left_out":24}
{"sheet":"Instructions","index":4,"n_rows":21,"n_cols":14,"rows_kept":21,"cut":false,"hidden":false,"merged":[[75,1,75,2],[3,1,15,8],[43,3,43,11],[58,1,58,2],[58,4,58,5],[58,7,58,8],[58,10,58,11]]}
["Information",null,null,null,null,null,null,null,null,null,null,null,null," "]
[]
[]
[null,"To run the model: \n1. Select the modelling year on the Assumptions! sheet cell B4\n2. On the Capacity Model! sheet add any additional spectrum bands to cells E5:E9 and J5:J9 to model the capacity impact of a spectrum increase in the modelling year\n3. On the Spectrum Opt! sheet click spectrum optimisation button in top right corner\n4. On the Capacity Model! sheet Cells B13:H17 give the capacity in 2012. Cells B20:H24 give the capacity in the modelling year with the only the spectrum outlined in the Assumptions! sheet, cells B27:H31 give this capacity relative to the capacity in 2012. Cells B34:H38 give the capacity in the modelling year with the base spectrum plus the spectrum increase, cells B41:H45 give this capacity relative to 2012. Cells B48:H52 give the increase in capacity as a result of the spectrum increase.\n5. Cells B56:L148 are used for plotting graphs; change the modelling year accordingly and paste values from the cells indicated to update the results.\n6. After changing any of the assumptions you will need to re-run the spectrum optimisation macro (see step 3)."]
[]
[]
[]
[]
[]
[]
[]
[]
[]
[]
[]
{"$rows_left_out":7}
{"sheet":"Assumptions","index":5,"n_rows":101,"n_cols":14,"rows_kept":101,"cut":false,"hidden":false,"merged":[[5,4,5,5],[5,1,5,2],[5,7,5,8],[5,10,5,11],[51,3,51,11],[83,1,83,2],[66,1,66,2],[66,4,66,5],[66,7,66,8],[66,10,66,11]]}
["Assumptions",null,null,null,null,null,null,null,null,null,null,null,null," "]
[]
["Number of Starting Sites",18000]
["Modelling year",2030]
[]
["Single User Throughput","0 - 50%",null,null,"50 - 80%",null,null,"80 - 90%",null,null,"90 - 100%"]
[null,"Out-to-Out","Out-to-In",null,"Out-to-Out","Out-to-In",null,"Out-to-Out","Out-to-In",null,"Out-to-Out","Out-to-In",null,"Average frequency (GHz)"]
["Sub 1 GHz",{"$f":"IF($B$3=12000,B74,B69)","v":8.1628224556765101},{"$f":"IF($B$3=12000,C74,C69)","v":8.0332895035263707},null,{"$f":"IF($B$3=12000,E74,E69)","v":8.1077275331181102},7.6667574544564099,null,8.5014799628359903,7.6802428417229498,null,9.0646418069457102,7.7547839135708099,null,0.5]
["1 - 2 GHz ",{"$f":"IF($B$3=12000,B75,B70)","v":8.1119873203378994},7.2193782425548498,null,{"$f":"IF($B$3=12000,E75,E70)","v":7.9714450788514197},6.2476909526995703,null,8.2324925002835005,5.8923928155524203,null,8.6140255826621299,5.6116843053644798,null,1.5]
["2 - 3 GHz",{"$f":"IF($B$3=12000,B76,B71)","v":8.0728518570003303},6.5525837967492002,null,{"$f":"IF($B$3=12000,E76,E71)","v":7.8683505708214403},5.3726770383316804,null,8.0471930398981701,4.9931495295751702,null,8.3407108913699108,4.61020194958747,null,2.5]
["3 - 4 GHz",{"$f":"GROWTH(B$8:B$10,$N$8:$N$10,$N11)","v":8.026351307889108},{"$f":"GROWTH(C$8:C$10,$N$8:$N$10,$N11)","v":5.9081897013531659},null,{"$f":"GROWTH(E$8:E$10,$N$8:$N$10,$N11)","v":7.74624432688932},{"$f":"GROWTH(F$8:F$10,$N$8:$N$10,$N11)","v":4.4574485967466151},null,{"$f":"GROWTH(H$8:H$10,$N$8:$N$10,$N11)","v":7.816997688892811},{"$f":"GROWTH(I$8:I$10,$N$8:$N$10,$N11)","v":3.959861761693181},null,{"$f":"GROWTH(K$8:K$10,$N$8:$N$10,$N11)","v":7.9757655235007716},{"$f":"GROWTH(L$8:L$10,$N$8:$N$10,$N11)","v":3.4802561527498361},null,3.5]
["4 - 6 GHz",{"$f":"GROWTH(B$8:B$10,$N$8:$N$10,$N12)","v":7.9599096613853035},{"$f":"GROWTH(C$8:C$10,$N$8:$N$10,$N12)","v":5.0710022728012927},null,{"$f":"GROWTH(E$8:E$10,$N$8:$N$10,$N12)","v":7.5740751193176719},{"$f":"GROWTH(F$8:F$10,$N$8:$N$10,$N12)","v":3.4140556961556072},null,{"$f":"GROWTH(H$8:H$10,$N$8:$N$10,$N12)","v":7.5015739784799473},{"$f":"GROWTH(I$8:I$10,$N$8:$N$10,$N12)","v":2.8670135129762877},null,{"$f":"GROWTH(K$8:K$10,$N$8:$N$10,$N12)","v":7.4931028386941891},{"$f":"GROWTH(L$8:L$10,$N$8:$N$10,$N12)","v":2.3562637230241332},null,5]
[]
["Sub 1 GHz",{"$f":"B79","v":8.0475245330477492},{"$f":"C79","v":4.4047334418938702},null,{"$f":"E79","v":7.10959221889566},{"$f":"F79","v":2.9992202697658099},null,6.5783222968748998,2.4951686475303001,null,8.4850626063766406,4.1084123868712998,null,0.5]
["1 - 2 GHz ",{"$f":"B80","v":6.4472127629031402},1.89343748304121,null,{"$f":"E80","v":5.06216795880104},1.1869199529513199,null,4.50188385927708,0.99756748683297403,null,6.4315456804652804,1.7181403196584499,null,1.5]
{"$rows_left_out":87}
{"sheet":"Projections","index":6,"n_rows":51,"n_cols":23,"rows_kept":51,"cut":false,"hidden":false,"merged":[]}
["Projections",null,null,null,null,null,null,null,null,null,null," "]
[]
[null,"Unit",2012,2013,2014,2015,2016,2017,2018,2019,2020,2021,2022,2023,2024,2025,2026,2027,2028,2029,2030,null,"Modelling year"]
[]
["Spectral Efficiency"]
["Macro cells","bps/Hz",{"$f":"Assumptions!C21","v":1.64},{"$f":"C6*((Assumptions!$D$21/Assumptions!$C$21)^(1/18))","v":1.8152707993036896},{"$f":"D6*((Assumptions!$D$21/Assumptions!$C$21)^(1/18))","v":2.0092732163443028},{"$f":"E6*((Assumptions!$D$21/Assumptions!$C$21)^(1/18))","v":2.2240091447883037},{"$f":"F6*((Assumptions!$D$21/Assumptions!$C$21)^(1/18))","v":2.4616944255601094},{"$f":"G6*((Assumptions!$D$21/Assumptions!$C$21)^(1/18))","v":2.7247817119072786},{"$f":"H6*((Assumptions!$D$21/Assumptions!$C$21)^(1/18))","v":3.0159857781109767},{"$f":"I6*((Assumptions!$D$21/Assumptions!$C$21)^(1/18))","v":3.3383115330000446},{"$f":"J6*((Assumptions!$D$21/Assumptions!$C$21)^(1/18))","v":3.6950850273376319},{"$f":"K6*((Assumptions!$D$21/Assumptions!$C$21)^(1/18))","v":4.0899877750428528},{"$f":"L6*((Assumptions!$D$21/Assumptions!$C$21)^(1/18))","v":4.5270947424050965},{"$f":"M6*((Assumptions!$D$21/Assumptions!$C$21)^(1/18))","v":5.0109163972983115},{"$f":"N6*((Assumptions!$D$21/Assumptions!$C$21)^(1/18))","v":5.5464452522973602},{"$f":"O6*((Assumptions!$D$21/Assumptions!$C$21)^(1/18))","v":6.1392073819707216},{"$f":"P6*((Assumptions!$D$21/Assumptions!$C$21)^(1/18))","v":6.7953194459518924},{"$f":"Q6*((Assumptions!$D$21/Assumptions!$C$21)^(1/18))","v":7.521551806205486},{"$f":"R6*((Assumptions!$D$21/Assumptions!$C$21)^(1/18))","v":8.325398389789477},{"$f":"S6*((Assumptions!$D$21/Assumptions!$C$21)^(1/18))","v":9.2151540180212166},{"$f":"T6*((Assumptions!$D$21/Assumptions!$C$21)^(1/18))","v":10.199999999999989},null,{"$f":"INDEX(C6:U6,MATCH(Assumptions!$B$4,Projections!$C$3:$U$3,0))","v":10.199999999999989}]
["Small cells","bps/Hz",{"$f":"C6/Assumptions!$C$50","v":0.54666666666666663},{"$f":"D6/Assumptions!$C$50","v":0.60509026643456321},{"$f":"E6/Assumptions!$C$50","v":0.6697577387814343},{"$f":"F6/Assumptions!$C$50","v":0.74133638159610127},{"$f":"G6/Assumptions!$C$50","v":0.82056480852003644},{"$f":"H6/Assumptions!$C$50","v":0.90826057063575949},{"$f":"I6/Assumptions!$C$50","v":1.0053285927036588},{"$f":"J6/Assumptions!$C$50","v":1.1127705110000148},{"$f":"K6/Assumptions!$C$50","v":1.231695009112544},{"$f":"L6/Assumptions!$C$50","v":1.3633292583476175},{"$f":"M6/Assumptions!$C$50","v":1.5090315808016987},{"$f":"N6/Assumptions!$C$50","v":1.6703054657661038},{"$f":"O6/Assumptions!$C$50","v":1.84881508409912},{"$f":"P6/Assumptions!$C$50","v":2.0464024606569073},{"$f":"Q6/Assumptions!$C$50","v":2.2651064819839641},{"$f":"R6/Assumptions!$C$50","v":2.5071839354018288},{"$f":"S6/Assumptions!$C$50","v":2.7751327965964925},{"$f":"T6/Assumptions!$C$50","v":3.0717180060070723},{"$f":"U6/Assumptions!$C$50","v":3.3999999999999964},null,{"$f":"INDEX(C7:U7,MATCH(Assumptions!$B$4,Projections!$C$3:$U$3,0))","v":3.3999999999999964}]
[]
["Number of Macro Sites"]
["0 - 50%","#",{"$f":"Assumptions!C24","v":7181},{"$f":"C10*((Assumptions!$D24/Assumptions!$C24)^(1/8))","v":7252.81},{"$f":"D10*((Assumptions!$D24/Assumptions!$C24)^(1/8))","v":7325.3381000000008},{"$f":"E10*((Assumptions!$D24/Assumptions!$C24)^(1/8))","v":7398.5914810000013},{"$f":"F10*((Assumptions!$D24/Assumptions!$C24)^(1/8))","v":7472.5773958100017},{"$f":"G10*((Assumptions!$D24/Assumptions!$C24)^(1/8))","v":7547.3031697681017},{"$f":"H10*((Assumptions!$D24/Assumptions!$C24)^(1/8))","v":7622.7762014657828},{"$f":"I10*((Assumptions!$D24/Assumptions!$C24)^(1/8))","v":7699.0039634804407},{"$f":"J10*((Assumptions!$D24/Assumptions!$C24)^(1/8))","v":7775.9940031152455},{"$f":"K10*((Assumptions!$D24/Assumptions!$C24)^(1/8))","v":7853.7539431463983},{"$f":"L10*((Assumptions!$D24/Assumptions!$C24)^(1/8))","v":7932.2914825778626},{"$f":"M10*((Assumptions!$D24/Assumptions!$C24)^(1/8))","v":8011.6143974036413},{"$f":"N10*((Assumptions!$D24/Assumptions!$C24)^(1/8))","v":8091.7305413776776},{"$f":"O10*((Assumptions!$D24/Assumptions!$C24)^(1/8))","v":8172.6478467914549},{"$f":"P10*((Assumptions!$D24/Assumptions!$C24)^(1/8))","v":8254.3743252593704},{"$f":"Q10*((Assumptions!$D24/Assumptions!$C24)^(1/8))","v":8336.9180685119645},{"$f":"R10*((Assumptions!$D24/Assumptions!$C24)^(1/8))","v":8420.2872491970847},{"$f":"S10*((Assumptions!$D24/Assumptions!$C24)^(1/8))","v":8504.4901216890557},{"$f":"T10*((Assumptions!$D24/Assumptions!$C24)^(1/8))","v":8589.5350229059459},null,{"$f":"INDEX(C10:U10,MATCH(Assumptions!$B$4,Projections!$C$3:$U$3,0))","v":8589.5350229059459}]
["50 - 80%","#",{"$f":"Assumptions!C25","v":5473},{"$f":"C11*((Assumptions!$D25/Assumptions!$C25)^(1/8))","v":5527.7300000000005},{"$f":"D11*((Assumptions!$D25/Assumptions!$C25)^(1/8))","v":5583.0073000000002},{"$f":"E11*((Assumptions!$D25/Assumptions!$C25)^(1/8))","v":5638.8373730000003},{"$f":"F11*((Assumptions!$D25/Assumptions!$C25)^(1/8))","v":5695.2257467300005},{"$f":"G11*((Assumptions!$D25/Assumptions!$C25)^(1/8))","v":5752.1780041973007},{"$f":"H11*((Assumptions!$D25/Assumptions!$C25)^(1/8))","v":5809.6997842392739},{"$f":"I11*((Assumptions!$D25/Assumptions!$C25)^(1/8))","v":5867.7967820816666},{"$f":"J11*((Assumptions!$D25/Assumptions!$C25)^(1/8))","v":5926.4747499024834},{"$f":"K11*((Assumptions!$D25/Assumptions!$C25)^(1/8))","v":5985.7394974015078},{"$f":"L11*((Assumptions!$D25/Assumptions!$C25)^(1/8))","v":6045.5968923755227},{"$f":"M11*((Assumptions!$D25/Assumptions!$C25)^(1/8))","v":6106.0528612992775},{"$f":"N11*((Assumptions!$D25/Assumptions!$C25)^(1/8))","v":6167.1133899122706},{"$f":"O11*((Assumptions!$D25/Assumptions!$C25)^(1/8))","v":6228.7845238113932},{"$f":"P11*((Assumptions!$D25/Assumptions!$C25)^(1/8))","v":6291.072369049507},{"$f":"Q11*((Assumptions!$D25/Assumptions!$C25)^(1/8))","v":6353.9830927400017},{"$f":"R11*((Assumptions!$D25/Assumptions!$C25)^(1/8))","v":6417.5229236674013},{"$f":"S11*((Assumptions!$D25/Assumptions!$C25)^(1/8))","v":6481.698152904075},{"$f":"T11*((Assumptions!$D25/Assumptions!$C25)^(1/8))","v":6546.5151344331161},null,{"$f":"INDEX(C11:U11,MATCH(Assumptions!$B$4,Projections!$C$3:$U$3,0))","v":6546.5151344331161}]
["80 - 90%","#",{"$f":"Assumptions!C26","v":2094},{"$f":"C12*((Assumptions!$D26/Assumptions!$C26)^(1/8))","v":2114.94},{"$f":"D12*((Assumptions!$D26/Assumptions!$C26)^(1/8))","v":2136.0894000000003},{"$f":"E12*((Assumptions!$D26/Assumptions!$C26)^(1/8))","v":2157.4502940000002},{"$f":"F12*((Assumptions!$D26/Assumptions!$C26)^(1/8))","v":2179.0247969400002},{"$f":"G12*((Assumptions!$D26/Assumptions!$C26)^(1/8))","v":2200.8150449094001},{"$f":"H12*((Assumptions!$D26/Assumptions!$C26)^(1/8))","v":2222.8231953584941},{"$f":"I12*((Assumptions!$D26/Assumptions!$C26)^(1/8))","v":2245.0514273120789},{"$f":"J12*((Assumptions!$D26/Assumptions!$C26)^(1/8))","v":2267.5019415851998},{"$f":"K12*((Assumptions!$D26/Assumptions!$C26)^(1/8))","v":2290.176961001052},{"$f":"L12*((Assumptions!$D26/Assumptions!$C26)^(1/8))","v":2313.0787306110624},{"$f":"M12*((Assumptions!$D26/Assumptions!$C26)^(1/8))","v":2336.2095179171729},{"$f":"N12*((Assumptions!$D26/Assumptions!$C26)^(1/8))","v":2359.5716130963447},{"$f":"O12*((Assumptions!$D26/Assumptions!$C26)^(1/8))","v":2383.1673292273081},{"$f":"P12*((Assumptions!$D26/Assumptions!$C26)^(1/8))","v":2406.9990025195812},{"$f":"Q12*((Assumptions!$D26/Assumptions!$C26)^(1/8))","v":2431.0689925447768},{"$f":"R12*((Assumptions!$D26/Assumptions!$C26)^(1/8))","v":2455.3796824702245},{"$f":"S12*((Assumptions!$D26/Assumptions!$C26)^(1/8))","v":2479.9334792949267},{"$f":"T12*((Assumptions!$D26/Assumptions!$C26)^(1/8))","v":2504.7328140878758},null,{"$f":"INDEX(C12:U12,MATCH(Assumptions!$B$4,Projections!$C$3:$U$3,0))","v":2504.7328140878758}]
["90 - 100%","#",{"$f":"Assumptions!C27","v":3252},{"$f":"C13*((Assumptions!$D27/Assumptions!$C27)^(1/8))","v":3284.52},{"$f":"D13*((Assumptions!$D27/Assumptions!$C27)^(1/8))","v":3317.3652000000002},{"$f":"E13*((Assumptions!$D27/Assumptions!$C27)^(1/8))","v":3350.5388520000001},{"$f":"F13*((Assumptions!$D27/Assumptions!$C27)^(1/8))","v":3384.0442405200001},{"$f":"G13*((Assumptions!$D27/Assumptions!$C27)^(1/8))","v":3417.8846829252002},{"$f":"H13*((Assumptions!$D27/Assumptions!$C27)^(1/8))","v":3452.0635297544522},{"$f":"I13*((Assumptions!$D27/Assumptions!$C27)^(1/8))","v":3486.5841650519969},{"$f":"J13*((Assumptions!$D27/Assumptions!$C27)^(1/8))","v":3521.4500067025169},{"$f":"K13*((Assumptions!$D27/Assumptions!$C27)^(1/8))","v":3556.6645067695422},{"$f":"L13*((Assumptions!$D27/Assumptions!$C27)^(1/8))","v":3592.2311518372376},{"$f":"M13*((Assumptions!$D27/Assumptions!$C27)^(1/8))","v":3628.1534633556098},{"$f":"N13*((Assumptions!$D27/Assumptions!$C27)^(1/8))","v":3664.4349979891658},{"$f":"O13*((Assumptions!$D27/Assumptions!$C27)^(1/8))","v":3701.0793479690574},{"$f":"P13*((Assumptions!$D27/Assumptions!$C27)^(1/8))","v":3738.090141448748},{"$f":"Q13*((Assumptions!$D27/Assumptions!$C27)^(1/8))","v":3775.4710428632357},{"$f":"R13*((Assumptions!$D27/Assumptions!$C27)^(1/8))","v":3813.2257532918679},{"$f":"S13*((Assumptions!$D27/Assumptions!$C27)^(1/8))","v":3851.3580108247866},{"$f":"T13*((Assumptions!$D27/Assumptions!$C27)^(1/8))","v":3889.8715909330344},null,{"$f":"INDEX(C13:U13,MATCH(Assumptions!$B$4,Projections!$C$3:$U$3,0))","v":3889.8715909330344}]
[]
["Number of Small Cells"]
{"$rows_left_out":37}
{"sheet":"Spectrum Opt","index":7,"n_rows":39,"n_cols":18,"rows_kept":39,"cut":false,"hidden":false,"merged":[[16,16,16,17],[29,16,29,17],[38,7,38,8],[25,7,25,8],[12,7,12,8],[15,10,15,17],[28,10,28,17],[12,1,12,2],[12,3,12,4],[12,5,12,6],[38,1,38,2],[38,3,38,4],[38,5,38,6],[25,1,25,2],[25,3,25,4],[25,5,25,6],[29,1,29,2],[29,3,29,4],[29,5,29,6],[16,1,16,2],[16,3,16,4],[15,1,15,8],[28,1,28,8],[3,12,3,13],[3,14,3,15],[3,5,3,6],[3,1,3,2],[3,3,3,4],[3,7,3,8],[2,1,2,8],[2,10,2,17],[3,16,3,17],[16,5,16,6],[29,10,29,11],[29,12,29,13],[29,14,29,15],[12,10,12,11],[12,12,12,13],[12,14,12,15],[16,10,16,11],[16,12,16,13],[16,14,16,15],[16,7,16,8],[29,7,29,8],[3,10,3,11]]}
["Spectrum Optimisation",null,null,null," Use Spectrum optimisation button to run model"]
[2012]
[null,"Macro Cells",null,null,null,null,null,null,null,null,"Small Cells"]
[null,"0-50%",null,"50-80%",null,"80-90%",null,"90-100%",null,null,"0-50%",null,"50-80%",null,"80-90%",null,"90-100%"]
[null,"Out/Out","Out/In","Out/Out","Out/In","Out/Out","Out/In","Out/Out","Out/In",null,"Out/Out","Out/In","Out/Out","Out/In","Out/Out","Out/In","Out/Out","Out/In"]
["Sub 1 GHz",0.38203085554763039,{"$f":"1-B6","v":0.61796914445236961},0.36973656007800554,{"$f":"1-D6","v":0.63026343992199441},0,{"$f":"1-F6","v":1},0,{"$f":"1-H6","v":1},null,1,{"$f":"1-K6","v":0},1,{"$f":"1-M6","v":0},1,{"$f":"1-O6","v":0},1,{"$f":"1-Q6","v":0}]
["1 - 2 GHz ",0,{"$f":"1-B7","v":1},0,{"$f":"1-D7","v":1},0,{"$f":"1-F7","v":1},0,{"$f":"1-H7","v":1},null,1,{"$f":"1-K7","v":0},1,{"$f":"1-M7","v":0},1,{"$f":"1-O7","v":0},1,{"$f":"1-Q7","v":0}]
["2 - 3 GHz",0.37466975948104414,{"$f":"1-B8","v":0.6253302405189558},0.44396337293744764,{"$f":"1-D8","v":0.5560366270625523},0.48938818025073788,{"$f":"1-F8","v":0.51061181974926217},0.46028392582372063,{"$f":"1-H8","v":0.53971607417627943},null,1,{"$f":"1-K8","v":0},1,{"$f":"1-M8","v":0},1,{"$f":"1-O8","v":0},1,{"$f":"1-Q8","v":0}]
["3 - 4 GHz",0.5,{"$f":"1-B9","v":0.5},0.5,{"$f":"1-D9","v":0.5},0.5,{"$f":"1-F9","v":0.5},0.5,{"$f":"1-H9","v":0.5},null,1,{"$f":"1-K9","v":0},1,{"$f":"1-M9","v":0},1,{"$f":"1-O9","v":0},1,{"$f":"1-Q9","v":0}]
["4 - 6 GHz",0.5,{"$f":"1-B10","v":0.5},0.5,{"$f":"1-D10","v":0.5},0.5,{"$f":"1-F10","v":0.5},0.5,{"$f":"1-H10","v":0.5},null,1,{"$f":"1-K10","v":0},1,{"$f":"1-M10","v":0},1,{"$f":"1-O10","v":0},1,{"$f":"1-Q10","v":0}]
[]
["2012 Capacity per person",{"$f":"'Capacity Model'!F13","v":0.4990839010148263},{"$f":"'Capacity Model'!G13","v":0.49908390637542521},{"$f":"'Capacity Model'!F14","v":0.50904805358993077},{"$f":"'Capacity Model'!G14","v":0.50904805732697977},{"$f":"'Capacity Model'!F15","v":0.58269417798159218},{"$f":"'Capacity Model'!G15","v":0.58269418497330028},{"$f":"'Capacity Model'!F16","v":0.67394137450105873},{"$f":"'Capacity Model'!G16","v":0.67394137345062866}]
["2012 Capacity per person",{"$f":"MIN(B12:C12)","v":0.4990839010148263},null,{"$f":"MIN(D12:E12)","v":0.50904805358993077},null,{"$f":"MIN(F12:G12)","v":0.58269417798159218},null,0.67394137345062866]
[]
[{"$f":"Assumptions!B4","v":2030}]
{"$rows_left_out":25}
{"sheet":"Capacity Model","index":8,"n_rows":148,"n_cols":13,"rows_kept":148,"cut":false,"hidden":false,"merged":[[53,1,53,5],[53,7,53,11],[2,2,2,5],[2,7,2,10],[10,9,10,11],[10,5,10,7],[10,1,10,3]]}
["Capacity model",null,null,null,null,null,null,null,null,null,null,null," "]
[]
[null,null,"Macro Cell Spectrum Availability",null,null,null,null,"Small Cell Spectrum Availability"]
["Spectrum Availability","Unit","2012 Base Case",{"$f":"CONCATENATE(Assumptions!$B$4,\" Base Case\")","v":"2030 Base Case"},{"$f":"CONCATENATE(Assumptions!$B$4,\" Increase\")","v":"2030 Increase"},{"$f":"CONCATENATE(Assumptions!$B$4,\" Total\")","v":"2030 Total"},null,"2012 Base Case",{"$f":"CONCATENATE(Assumptions!$B$4,\" Base Case\")","v":"2030 Base Case"},{"$f":"CONCATENATE(Assumptions!$B$4,\" Shock\")","v":"2030 Shock"},{"$f":"CONCATENATE(Assumptions!$B$4,\" Total\")","v":"2030 Total"}]
["Sub 1 GHz","MHz",{"$f":"Projections!C40","v":10},{"$f":"Projections!W40","v":90},0,{"$f":"D5+E5","v":90},null,{"$f":"Projections!C47","v":0},{"$f":"Projections!W47","v":0},0,{"$f":"I5+J5","v":0}]
["1 - 2 GHz ","MHz",{"$f":"Projections!C41","v":22},{"$f":"Projections!W41","v":72},0,{"$f":"D6+E6","v":72},null,{"$f":"Projections!C48","v":0},{"$f":"Projections!W48","v":0},0,{"$f":"I6+J6","v":0}]
["2 - 3 GHz","MHz",{"$f":"Projections!C42","v":60},{"$f":"Projections!W42","v":158},0,158,null,{"$f":"Projections!C49","v":60},{"$f":"Projections!W49","v":186},0,186]
["3 - 4 GHz","MHz",{"$f":"Projections!C43","v":0},{"$f":"Projections!W43","v":0},0,0,null,{"$f":"Projections!C50","v":0},{"$f":"Projections!W50","v":133},0,133]
["4 - 6 GHz","MHz",{"$f":"Projections!C44","v":0},{"$f":"Projections!W44","v":0},0,0,null,{"$f":"Projections!C51","v":0},{"$f":"Projections!W51","v":0},0,0]
[null,null,null,null," Add additional downlink spectrum to test sensitivity",null,null,null,null," Add additional downlink spectrum to test sensitivity"]
[null,"Total",null,null,null,"Per Person"]
["2012 Base Capacity","Out/Out","Out/In","Total",null,"Out/Out","Out/In","Average"]
["0 - 50%",{"$f":"SUMPRODUCT($C$5:$C$9,Assumptions!B$8:B$12,'Spectrum Opt'!B$6:B$10)*Projections!$C$6*Projections!$C10+SUMPRODUCT($H$5:$H$9,Assumptions!B$14:B$18,'Spectrum Opt'!K$6:K$10)*Projections!$C$7*Projections!$C16","v":3566979.4663126431},{"$f":"SUMPRODUCT($C$5:$C$9,Assumptions!C$8:C$12,'Spectrum Opt'!C$6:C$10)*Projections!$C$6*Projections!$C10+SUMPRODUCT($H$5:$H$9,Assumptions!C$14:C$18,'Spectrum Opt'!L$6:L$10)*Projections!$C$7*Projections!$C16","v":5350469.2569376975},null,null,{"$f":"B13/Projections!C34","v":0.4990839010148263},{"$f":"C13/Projections!C28","v":0.49908390637542521}]
["50 - 80%",{"$f":"SUMPRODUCT($C$5:$C$9,Assumptions!E$8:E$12,'Spectrum Opt'!D$6:D$10)*Projections!$C$6*Projections!$C11+SUMPRODUCT($H$5:$H$9,Assumptions!E$14:E$18,'Spectrum Opt'!M$6:M$10)*Projections!$C$7*Projections!$C17","v":2184177.3194948249},{"$f":"SUMPRODUCT($C$5:$C$9,Assumptions!F$8:F$12,'Spectrum Opt'!E$6:E$10)*Projections!$C$6*Projections!$C11+SUMPRODUCT($H$5:$H$9,Assumptions!F$14:F$18,'Spectrum Opt'!N$6:N$10)*Projections!$C$7*Projections!$C17","v":3276266.0032941247},null,null,{"$f":"B14/Projections!C35","v":0.50904805358993077},{"$f":"C14/Projections!C29","v":0.50904805732697977}]
["80 - 90%",{"$f":"SUMPRODUCT($C$5:$C$9,Assumptions!H$8:H$12,'Spectrum Opt'!F$6:F$10)*Projections!$C$6*Projections!$C12+SUMPRODUCT($H$5:$H$9,Assumptions!H$14:H$18,'Spectrum Opt'!O$6:O$10)*Projections!$C$7*Projections!$C18","v":822844.73678011412},{"$f":"SUMPRODUCT($C$5:$C$9,Assumptions!I$8:I$12,'Spectrum Opt'!G$6:G$10)*Projections!$C$6*Projections!$C12+SUMPRODUCT($H$5:$H$9,Assumptions!I$14:I$18,'Spectrum Opt'!P$6:P$10)*Projections!$C$7*Projections!$C18","v":1234267.1199800589},null,null,{"$f":"B15/Projections!C36","v":0.58269417798159218},{"$f":"C15/Projections!C30","v":0.58269418497330028}]
{"$rows_left_out":133}