{"text_format":"1","workbook":"xlsx","n_sheets":24,"sheets":["TITLE","Key","Contents","MAIN SHEET - OUTPUT  ","SUMMARY CALCULATION","MAIN CALCULATION ","VOLUMES CALCULATION","ASSET COST CALCULATION(2)","CAPITAL CALCULATION ASSUMPTION","EFF. & INFLATION ASSUMPTION","AVE & CVE ASSUMPTION","2014 WBA Consultation","PRICE CHANGE ASSUMPTION","VOLUME ASSUMPTION","INPUT DATA CALCULATION","INPUT DATA ASSUMPTION (2) ","INPUT DATA ASSUMPTION (1) ","INPUT DATA SUMMARYa","BT_INPUT DATA S135","BT_LOOK UP TABLE","INPUT DATA_OTHER ","INPUT DATA_Price List Changes ","INPUT DATA_Inflation Forecasts","WLRLLU Inflation"],"not_rendered":{"charts":0,"images":1,"macros":1,"external_links":8,"defined_names":953,"comments":1,"pivot_tables":0},"unopened":[],"bounds":{"document_bytes":16777216,"sheet_cells":100000,"rows_first":2000,"rows_last":500,"rows_between":2000,"halvings":0,"cell_chars":16384,"cell_head_chars":4096},"cells_cut":0,"cells_raw":0,"read":"whole","date_system":"1900"}

{"sheet":"TITLE","index":0,"n_rows":33,"n_cols":2,"rows_kept":33,"cut":false,"hidden":false,"merged":[[27,0,27,1],[16,0,16,1],[18,0,18,1],[20,0,20,1],[22,0,22,1],[24,0,24,1],[26,0,26,1]]}
[]
[]
[]
["Information"]
[]
["Title ","Review of the wholesale broadband access markets - Charge control model for WBA Market A services"]
{"$rows_left_out":28}
{"sheet":"Key","index":1,"n_rows":18,"n_cols":2,"rows_kept":18,"cut":false,"hidden":false,"merged":[]}
["Key"]
["This sheet provides a key to the cell types used in the model"]
[]
[null,"Input"]
[]
[null,"Output"]
{"$rows_left_out":13}
{"sheet":"Contents","index":2,"n_rows":61,"n_cols":5,"rows_kept":61,"cut":false,"hidden":false,"merged":[[60,4,60,20],[59,4,59,20],[53,4,53,20],[54,4,54,20],[55,4,55,20],[56,4,56,20],[57,4,57,20],[58,4,58,20],[52,4,52,20],[41,4,41,20],[42,4,42,20],[43,4,43,20],[44,4,44,20],[45,4,45,20],[46,4,46,20],[47,4,47,20],[48,4,48,20],[49,4,49,20],[50,4,50,20],[51,4,51,20]]}
["WBA Charge control model 2013 (updated for the 2014 WBA consultation & June 2014 WBA statement)"]
[]
["Model update from 2014 WBA Consultation to WBA statement"]
["1) All model updates from the 2014 WBA Consultation are highlighted in Blue "]
["2)To produce the 2014 Final statement ensure the switch in tab \"MAIN SHEET - OUTPUT \" is selected as 2, and all input selection options (where applicable)"]
[" in cells Cells B5 to B24 on the same tab are selected to the 2014 Final statement option"]
{"$rows_left_out":56}
{"sheet":"MAIN SHEET - OUTPUT  ","index":3,"n_rows":103,"n_cols":10,"rows_kept":103,"cut":false,"hidden":false,"merged":[[2,3,2,8],[31,1,31,2],[31,3,31,5],[33,5,34,5],[35,0,36,0],[35,1,36,1],[35,2,36,2],[35,3,36,3],[35,4,36,4],[35,5,36,5],[33,0,34,0],[33,1,34,1],[33,2,34,2],[33,3,34,3],[33,4,34,4],[68,0,76,0],[37,5,38,5],[37,0,38,0],[37,1,38,1],[37,2,38,2],[37,3,38,3],[37,4,38,4]]}
["SHEET TYPE: ","OUTPUT - Value of X"]
[]
["ASSUMPTION Description","INPUT SELECTION","Description of selection","Assumption options"]
["Main input assumptions",null,null,1,2,3,4,5,6]
["Base year input cost adjust",4,{"$f":"'INPUT DATA ASSUMPTION (1) '!I4","v":"2012 RFS with BT's HON + CCA adjustment + DSLAM costs allocated 25% to Bandwidth"},{"$f":"'INPUT DATA ASSUMPTION (1) '!$I$11","v":"2012 RFS with (50% HON) + CCA adjustment + DSLAM costs allocated 25% to Bandwidth"},{"$f":"'INPUT DATA ASSUMPTION (1) '!$I$18","v":"2012 RFS with BT's HON + CCA adjustment"},{"$f":"'INPUT DATA ASSUMPTION (1) '!$I$25","v":"2012 RFS with  CCA adjustment + DSLAM costs allocated 25% to Bandwidth"},{"$f":"'INPUT DATA ASSUMPTION (1) '!$I$32","v":"2012 RFS with BT's HON + CCA adjustment + DSLAM costs allocated 25% to Bandwidth"},{"$f":"'INPUT DATA ASSUMPTION (1) '!$I$39","v":"NOT USED"},{"$f":"'INPUT DATA ASSUMPTION (1) '!$I$46","v":"NOT USED "},"Refer to sheet INPUT DATA ASSUMPTION (1) "]
["Market boundary change\n(Market 1 to Market A)",1,{"$f":"'INPUT DATA ASSUMPTION (2) '!I4","v":"Mid Costs removed (Costs/Revenue=0.5)"},{"$f":"'INPUT DATA ASSUMPTION (2) '!$I$11","v":"Mid Costs removed (Costs/Revenue=0.5)"},{"$f":"'INPUT DATA ASSUMPTION (2) '!$I$18","v":"High Costs removed (Costs/Revenue=0.7)"},{"$f":"'INPUT DATA ASSUMPTION (2) '!$I$25","v":"Low Costs removed  (Costs/Revenue=0.3)"},{"$f":"'INPUT DATA ASSUMPTION (2) '!$I$32","v":"NOT USED"},{"$f":"'INPUT DATA ASSUMPTION (2) '!$I$39","v":"NOT USED"},{"$f":"'INPUT DATA ASSUMPTION (2) '!$I$46","v":"NOT USED"},"Refer to sheet INPUT DATA ASSUMPTION (2) "]
{"$rows_left_out":98}
{"sheet":"SUMMARY CALCULATION","index":4,"n_rows":28,"n_cols":8,"rows_kept":28,"cut":false,"hidden":false,"merged":[]}
["SHEET TYPE: ","SUMMARY - Main modelling Calculations, Revenue, costs, and Margin"]
[]
["SUMMARY",null,{"$f":"'MAIN CALCULATION '!C30","v":"Base Year 2012"},{"$f":"'MAIN CALCULATION '!D30","v":"12/13"},{"$f":"'MAIN CALCULATION '!E30","v":"13/14"},{"$f":"'MAIN CALCULATION '!F30","v":"14/15"},{"$f":"'MAIN CALCULATION '!G30","v":"15/16"},{"$f":"'MAIN CALCULATION '!H30","v":"16/17"}]
[null,"Revenue (Excluding EOI)",{"$f":"'MAIN CALCULATION '!C31","v":260.5259483474137},{"$f":"'MAIN CALCULATION '!D31","v":280993.88351999997},{"$f":"'MAIN CALCULATION '!E31","v":286232.8586179901},{"$f":"'MAIN CALCULATION '!F31","v":326467.77382073656},{"$f":"'MAIN CALCULATION '!G31","v":349866.64927265182},{"$f":"'MAIN CALCULATION '!H31","v":361524.14053510426}]
[]
[]
{"$rows_left_out":23}
{"sheet":"MAIN CALCULATION ","index":5,"n_rows":40,"n_cols":8,"rows_kept":40,"cut":false,"hidden":false,"merged":[]}
["SHEET TYPE: ","CALCULATION - Main modelling Calculations, Revenue, costs, and Margin"]
[]
["End User rental services",null,"Base Year 2012","12/13","13/14","14/15","15/16","16/17"]
[null,"Revenue (Excluding EOI)",{"$f":"C5-C6","v":95.704049197096538},{"$f":"IF('2014 WBA Consultation'!E6=\"Forecast\",(C4*(1+'VOLUMES CALCULATION'!$D$6)*(1+'PRICE CHANGE ASSUMPTION'!$D$4)),(D5-D6))","v":99627.628209999995},{"$f":"D4*(1+'VOLUMES CALCULATION'!$E$6)*(1+'PRICE CHANGE ASSUMPTION'!$E$4)","v":112272.43796730583},{"$f":"E4*(1+'VOLUMES CALCULATION'!$F$6)*(1+'PRICE CHANGE ASSUMPTION'!$F$4)","v":111164.02832347361},{"$f":"F4*(1+'VOLUMES CALCULATION'!$G$6)*(1+'PRICE CHANGE ASSUMPTION'!$G$4)","v":105249.21270443824},{"$f":"G4*(1+'VOLUMES CALCULATION'!$H$6)*(1+'PRICE CHANGE ASSUMPTION'!$H$4)","v":98432.852692847999}]
[null,"Revenue",{"$f":"'INPUT DATA CALCULATION'!D4","v":157.74062826108283},{"$f":"'INPUT DATA CALCULATION'!D11","v":135391.62821}]
[null,"EOI Costs (operating costs ONLY)",{"$f":"'INPUT DATA CALCULATION'!D5","v":62.036579063986295},{"$f":"'INPUT DATA CALCULATION'!D12","v":35764}]
{"$rows_left_out":35}
{"sheet":"VOLUMES CALCULATION","index":6,"n_rows":21,"n_cols":8,"rows_kept":21,"cut":false,"hidden":false,"merged":[]}
["SHEET TYPE: ","CALCULATION - Rentals and Bandwidth Volumes"]
[]
["MODEL INPUT",null,"Starting volumes","12/13","13/14","14/15","15/16","16/17"]
[null,"End User Rentals (Internal & External)",{"$f":"C18","v":2000867.9531542889},{"$f":"IF('2014 WBA Consultation'!E7=2012,(C4*(1+'VOLUME ASSUMPTION'!D4)),D18)","v":1801382},{"$f":"D4*(1+'VOLUME ASSUMPTION'!E4)","v":1819395.82},{"$f":"E4*(1+'VOLUME ASSUMPTION'!F4)","v":1764813.9454000001},{"$f":"F4*(1+'VOLUME ASSUMPTION'!G4)","v":1637747.3413312002},{"$f":"G4*(1+'VOLUME ASSUMPTION'!H4)","v":1500176.5646593794}]
[null,"Bandwidth Volume (Internal & External)",{"$f":"C19","v":1464005.1945182367},{"$f":"IF('2014 WBA Consultation'!E7=2012,(C5*(1+'VOLUME ASSUMPTION'!D4)*(1+'VOLUME ASSUMPTION'!D5)),D19)","v":1819625},{"$f":"(D5*(1+'VOLUME ASSUMPTION'!E4))*(1+'VOLUME ASSUMPTION'!E5)","v":2389167.625},{"$f":"(E5*(1+'VOLUME ASSUMPTION'!F4))*(1+'VOLUME ASSUMPTION'!F5)","v":2896865.7453124998},{"$f":"(F5*(1+'VOLUME ASSUMPTION'!G4))*(1+'VOLUME ASSUMPTION'!G5)","v":3225949.69398},{"$f":"(G5*(1+'VOLUME ASSUMPTION'!H4))*(1+'VOLUME ASSUMPTION'!H5)","v":3398215.4076385316}]
[null,"End User Rentals annual % increase",null,{"$f":"'VOLUME ASSUMPTION'!D4","v":-0.01},{"$f":"'VOLUME ASSUMPTION'!E4","v":0.01},{"$f":"'VOLUME ASSUMPTION'!F4","v":-0.03},{"$f":"'VOLUME ASSUMPTION'!G4","v":-7.1999999999999995E-2},{"$f":"'VOLUME ASSUMPTION'!H4","v":-8.4000000000000005E-2}]
{"$rows_left_out":16}
{"sheet":"ASSET COST CALCULATION(2)","index":7,"n_rows":11,"n_cols":8,"rows_kept":11,"cut":false,"hidden":false,"merged":[]}
["SHEET TYPE: ","CALCULATION -Asset costs; GRC, NRC, MCE, and annual depreciation charge"]
[]
[]
["End User rental services",null,"Base Year 2012","12/13","13/14","14/15","15/16","16/17"]
[null,"WBA Depreciation Costs",{"$f":"'INPUT DATA CALCULATION'!D7","v":49.613785399901793},{"$f":"IF('2014 WBA Consultation'!E6=\"Forecast\", C5*(1+'VOLUMES CALCULATION'!D11*'AVE & CVE ASSUMPTION'!D5)*(1+'EFF. & INFLATION ASSUMPTION'!D7),'INPUT DATA CALCULATION'!D14)","v":35037.098535842633},{"$f":"D5*(1+'VOLUMES CALCULATION'!E11*'AVE & CVE ASSUMPTION'!E5)*(1+'EFF. & INFLATION ASSUMPTION'!E7)","v":35317.395324129371},{"$f":"E5*(1+'VOLUMES CALCULATION'!F11*'AVE & CVE ASSUMPTION'!F5)*(1+'EFF. & INFLATION ASSUMPTION'!F7)","v":34469.777836350266},{"$f":"F5*(1+'VOLUMES CALCULATION'!G11*'AVE & CVE ASSUMPTION'!G5)*(1+'EFF. & INFLATION ASSUMPTION'!G7)","v":32484.31863297649},{"$f":"G5*(1+'VOLUMES CALCULATION'!H11*'AVE & CVE ASSUMPTION'!H5)*(1+'EFF. & INFLATION ASSUMPTION'!H7)","v":30301.372420840467}]
[null,"WBA Return on CM",{"$f":"C7*'AVE & CVE ASSUMPTION'!C8","v":24.753133395910112},{"$f":"D7*'AVE & CVE ASSUMPTION'!D8","v":22211.790714415038},{"$f":"E7*'AVE & CVE ASSUMPTION'!E8","v":22389.485040130359},{"$f":"F7*'AVE & CVE ASSUMPTION'!F8","v":21852.13739916723},{"$f":"G7*'AVE & CVE ASSUMPTION'!G8","v":20593.454284975196},{"$f":"H7*'AVE & CVE ASSUMPTION'!H8","v":19209.574157024865}]
{"$rows_left_out":6}
{"sheet":"CAPITAL CALCULATION ASSUMPTION","index":8,"n_rows":46,"n_cols":9,"rows_kept":46,"cut":false,"hidden":false,"merged":[]}
["SHEET TYPE: ","Assumption selection - Calculation method for MCE & Depreciation charge"]
[null,null,"11/12","12/13","13/14","14/15","15/16","16/17"]
[{"$f":"'MAIN SHEET - OUTPUT  '!B24","v":1},"Rentals WBA Depreciation Costs",{"$f":"IF($A$3=1,C10,IF($A$3=2,C17,IF($A$3=3,C24,IF($A$3=4,C31,IF($A$3=5,C38,IF($A$3=6,C45,\"ERROR\"))))))","v":49.613785399901793},{"$f":"IF($A$3=1,D10,IF($A$3=2,D17,IF($A$3=3,D24,IF($A$3=4,D31,IF($A$3=5,D38,IF($A$3=6,D45,\"ERROR\"))))))","v":35037.098535842633},35317.395324129371,34469.777836350266,32484.31863297649,30301.372420840467,"Assumption selection"]
[null,"Rentals WBA Return on CM",{"$f":"IF($A$3=1,C11,IF($A$3=2,C18,IF($A$3=3,C25,IF($A$3=4,C32,IF($A$3=5,C39,IF($A$3=6,C46,\"ERROR\"))))))","v":24.753133395910112},22211.790714415038,22389.485040130359,21852.13739916723,20593.454284975196,19209.574157024865,"Main method"]
[null,"Rentals WBA MCE",{"$f":"IF($A$3=1,C12,IF($A$3=2,C19,IF($A$3=3,C26,IF($A$3=4,C33,IF($A$3=5,C40,IF($A$3=6,C47,\"ERROR\"))))))","v":250.03165046373849},205664.72883717628,207310.04666787368,202334.60554784472,190680.13226828887,177866.42737985984]
[null,"Bandwidth WBA Depreciation Costs",58.3586116201773,45265.137318407258,54616.009385643833,62275.904701980377,66945.102932916052,69304.516140683729]
{"$rows_left_out":41}
{"sheet":"EFF. & INFLATION ASSUMPTION","index":9,"n_rows":50,"n_cols":9,"rows_kept":50,"cut":false,"hidden":false,"merged":[]}
["SHEET TYPE: ","Assumption selection - Efficiency & Inflation assumptions"]
[null,null,null,null,null,null,null,null,"Assumption selection"]
[{"$f":"'MAIN SHEET - OUTPUT  '!B14","v":5},null,"Check","12/13","13/14","14/15","15/16","16/17",{"$f":"IF($A$3=1,I10,IF($A$3=2,I17,IF($A$3=3,I24,IF($A$3=4,I31,IF($A$3=5,I38,IF($A$3=6,I45,\"ERROR\"))))))","v":"2014 WBA Statement"}]
[null,"Efficiency",{"$f":"IF($A$3=1,C11,IF($A$3=2,C18,IF($A$3=3,C25,IF($A$3=4,C32,IF($A$3=5,C39,IF($A$3=6,C46,\"ERROR\"))))))","v":0},{"$f":"IF($A$3=1,D11,IF($A$3=2,D18,IF($A$3=3,D25,IF($A$3=4,D32,IF($A$3=5,D39,IF($A$3=6,D46,\"ERROR\"))))))","v":-0.05},-0.05,-0.05,-0.05,-0.05,{"$f":"CHOOSE($A$3,I11,I18,I25,I32,I39,I46)","v":0}]
[null,"Opex Nominal inflation",{"$f":"IF($A$3=1,C12,IF($A$3=2,C19,IF($A$3=3,C26,IF($A$3=4,C33,IF($A$3=5,C40,IF($A$3=6,C47,\"ERROR\"))))))","v":0},0.03,0.03,0.03,0.03,0.03,{"$f":"CHOOSE($A$3,I12,I19,I26,I33,I40,I47)","v":0}]
[null,"Inflation",0,2.7999999999999997E-2,1.6E-2,2.0750000000000001E-2,2.0250000000000001E-2,2.1000000000000001E-2,0]
{"$rows_left_out":45}
{"sheet":"AVE & CVE ASSUMPTION","index":10,"n_rows":49,"n_cols":9,"rows_kept":49,"cut":false,"hidden":false,"merged":[]}
["SHEET TYPE: ","Assumption selection - Cost volume elasticity Asset volume elasticity"]
[]
[{"$f":"'MAIN SHEET - OUTPUT  '!B9","v":5},null,"Check","12/13","13/14","14/15","15/16","16/17","Assumption selection"]
[null,"End User Rental CVE",{"$f":"IF($A$3=1,C11,IF($A$3=2,C18,IF($A$3=3,C25,IF($A$3=4,C32,IF($A$3=5,C39,IF($A$3=6,C46,\"ERROR\"))))))","v":0},{"$f":"IF($A$3=1,D11,IF($A$3=2,D18,IF($A$3=3,D25,IF($A$3=4,D32,IF($A$3=5,D39,IF($A$3=6,D46,\"ERROR\"))))))","v":0.8},0.8,0.8,0.8,0.8,"2014 WBA Statement - WACC 10.8%"]
[null,"End User Rental AVE",{"$f":"IF($A$3=1,C12,IF($A$3=2,C19,IF($A$3=3,C26,IF($A$3=4,C33,IF($A$3=5,C40,IF($A$3=6,C47,\"ERROR\"))))))","v":0},{"$f":"IF($A$3=1,D12,IF($A$3=2,D19,IF($A$3=3,D26,IF($A$3=4,D33,IF($A$3=5,D40,IF($A$3=6,D47,\"ERROR\"))))))","v":0.8},{"$f":"IF($A$3=1,E12,IF($A$3=2,E19,IF($A$3=3,E26,IF($A$3=4,E33,IF($A$3=5,E40,IF($A$3=6,E47,\"ERROR\"))))))","v":0.8},{"$f":"IF($A$3=1,F12,IF($A$3=2,F19,IF($A$3=3,F26,IF($A$3=4,F33,IF($A$3=5,F40,IF($A$3=6,F47,\"ERROR\"))))))","v":0.8},0.8,0.8]
[null,"Bandwidth CVE",{"$f":"IF($A$3=1,C13,IF($A$3=2,C20,IF($A$3=3,C27,IF($A$3=4,C34,IF($A$3=5,C41,IF($A$3=6,C48,\"ERROR\"))))))","v":0},0.66,0.66,0.66,0.66,0.66]
{"$rows_left_out":44}
{"sheet":"2014 WBA Consultation","index":11,"n_rows":46,"n_cols":9,"rows_kept":46,"cut":false,"hidden":false,"merged":[]}
["SHEET TYPE: ","Changes for the 2014 WBA Consulation"]
[]
[{"$f":"'MAIN SHEET - OUTPUT  '!D30","v":1},null,"Check","12/13","13/14","14/15","15/16","16/17","Assumption selection"]
[null,"Bandwidth Price change",{"$f":"IF($A$3=1,C11,IF($A$3=2,C18,IF($A$3=3,C25,IF($A$3=4,C32,IF($A$3=5,C39,IF($A$3=6,C46,\"ERROR\"))))))","v":0},{"$f":"IF($A$3=1,D11,IF($A$3=2,D18,IF($A$3=3,D25,IF($A$3=4,D32,IF($A$3=5,D39,IF($A$3=6,D46,\"ERROR\"))))))","v":0},0,0,{"$f":"IF($A$3=1,G11,IF($A$3=2,G18,IF($A$3=3,G25,IF($A$3=4,G32,IF($A$3=5,G39,IF($A$3=6,G46,\"ERROR\"))))))","v":0},0,"2014 WBA Consultation"]
[null,null,{"$f":"IF($A$3=1,C12,IF($A$3=2,C19,IF($A$3=3,C26,IF($A$3=4,C33,IF($A$3=5,C40,IF($A$3=6,C47,\"ERROR\"))))))","v":0},{"$f":"IF($A$3=1,D12,IF($A$3=2,D19,IF($A$3=3,D26,IF($A$3=4,D33,IF($A$3=5,D40,IF($A$3=6,D47,\"ERROR\"))))))","v":0},0,0,0,0]
[null,"2012/13 Costs - Forecast / actuals",{"$f":"IF($A$3=1,C13,IF($A$3=2,C20,IF($A$3=3,C27,IF($A$3=4,C34,IF($A$3=5,C41,IF($A$3=6,C48,\"ERROR\"))))))","v":0},0,"Actuals",0,0,0]
{"$rows_left_out":41}
{"sheet":"PRICE CHANGE ASSUMPTION","index":12,"n_rows":46,"n_cols":9,"rows_kept":46,"cut":false,"hidden":false,"merged":[]}
["SHEET TYPE: ","Assumption selection - Revenue price changes"]
[]
[{"$f":"'MAIN SHEET - OUTPUT  '!B20","v":1},null,"Check","12/13","13/14","14/15","15/16","16/17","Assumption selection"]
[null,"End User Rental ",{"$f":"IF($A$3=1,C11,IF($A$3=2,C18,IF($A$3=3,C25,IF($A$3=4,C32,IF($A$3=5,C39,IF($A$3=6,C46,\"ERROR\"))))))","v":0},{"$f":"IF($A$3=1,D11,IF($A$3=2,D18,IF($A$3=3,D25,IF($A$3=4,D32,IF($A$3=5,D39,IF($A$3=6,D46,\"ERROR\"))))))","v":-4.15464326707502E-2},0.11576308367283006,2.0750000000000001E-2,2.0250000000000001E-2,2.1000000000000001E-2,"Start Revenue - average of prior year"]
[null,"Bandwidth ",{"$f":"IF($A$3=1,C12,IF($A$3=2,C19,IF($A$3=3,C26,IF($A$3=4,C33,IF($A$3=5,C40,IF($A$3=6,C47,\"ERROR\"))))))","v":0},{"$f":"IF($A$3=1,D12,IF($A$3=2,D19,IF($A$3=3,D26,IF($A$3=4,D33,IF($A$3=5,D40,IF($A$3=6,D47,\"ERROR\"))))))","v":-0.17283265018290805},{"$f":"IF($A$3=1,E12,IF($A$3=2,E19,IF($A$3=3,E26,IF($A$3=4,E33,IF($A$3=5,E40,IF($A$3=6,E47,\"ERROR\"))))))","v":-0.26948483352393682},{"$f":"IF($A$3=1,F12,IF($A$3=2,F19,IF($A$3=3,F26,IF($A$3=4,F33,IF($A$3=5,F40,IF($A$3=6,F47,\"ERROR\"))))))","v":2.0750000000000001E-2},2.0250000000000001E-2,2.1000000000000001E-2]
[]
{"$rows_left_out":41}
{"sheet":"VOLUME ASSUMPTION","index":13,"n_rows":58,"n_cols":9,"rows_kept":58,"cut":false,"hidden":false,"merged":[]}
["SHEET TYPE: ","Assumption selection - Bandwidth and Rental volumes"]
[]
[{"$f":"'MAIN SHEET - OUTPUT  '!B7","v":4},null,"Check","12/13","13/14","14/15","15/16","16/17","Assumption selection"]
[null,"End User Rental Growth",{"$f":"IF($A$3=1,C11,IF($A$3=2,C18,IF($A$3=3,C25,IF($A$3=4,C32,IF($A$3=5,C39,IF($A$3=6,C46,\"ERROR\"))))))","v":0},{"$f":"IF($A$3=1,D11,IF($A$3=2,D18,IF($A$3=3,D25,IF($A$3=4,D32,IF($A$3=5,D39,IF($A$3=6,D46,\"ERROR\"))))))","v":-0.01},0.01,-0.03,{"$f":"IF($A$3=1,G11,IF($A$3=2,G18,IF($A$3=3,G25,IF($A$3=4,G32,IF($A$3=5,G39,IF($A$3=6,G46,\"ERROR\"))))))","v":-7.1999999999999995E-2},{"$f":"IF($A$3=1,H11,IF($A$3=2,H18,IF($A$3=3,H25,IF($A$3=4,H32,IF($A$3=5,H39,IF($A$3=6,H46,\"ERROR\"))))))","v":-8.4000000000000005E-2},"2014 WBA Statement"]
[null,"Bandwidth Growth/user",{"$f":"IF($A$3=1,C12,IF($A$3=2,C19,IF($A$3=3,C26,IF($A$3=4,C33,IF($A$3=5,C40,IF($A$3=6,C47,\"ERROR\"))))))","v":0},{"$f":"IF($A$3=1,D12,IF($A$3=2,D19,IF($A$3=3,D26,IF($A$3=4,D33,IF($A$3=5,D40,IF($A$3=6,D47,\"ERROR\"))))))","v":0.39},{"$f":"IF($A$3=1,E12,IF($A$3=2,E19,IF($A$3=3,E26,IF($A$3=4,E33,IF($A$3=5,E40,IF($A$3=6,E47,\"ERROR\"))))))","v":0.3},{"$f":"IF($A$3=1,F12,IF($A$3=2,F19,IF($A$3=3,F26,IF($A$3=4,F33,IF($A$3=5,F40,IF($A$3=6,F47,\"ERROR\"))))))","v":0.25},{"$f":"IF($A$3=1,G12,IF($A$3=2,G19,IF($A$3=3,G26,IF($A$3=4,G33,IF($A$3=5,G40,IF($A$3=6,G47,\"ERROR\"))))))","v":0.2},{"$f":"IF($A$3=1,H12,IF($A$3=2,H19,IF($A$3=3,H26,IF($A$3=4,H33,IF($A$3=5,H40,IF($A$3=6,H47,\"ERROR\"))))))","v":0.15}]
[]
{"$rows_left_out":53}
{"sheet":"INPUT DATA CALCULATION","index":14,"n_rows":31,"n_cols":12,"rows_kept":31,"cut":false,"hidden":false,"merged":[]}
["SHEET TYPE: ","CALCULATION - Base year input costs"]
[]
[null,null,"BANDWIDTH","RENTALS","EXCLUDED","TOTAL"]
[null,"Revenue",{"$f":"'INPUT DATA ASSUMPTION (1) '!C4*(1+'INPUT DATA ASSUMPTION (2) '!C4)","v":176.03512196840614},{"$f":"'INPUT DATA ASSUMPTION (1) '!D4*(1+'INPUT DATA ASSUMPTION (2) '!D4)","v":157.74062826108283},{"$f":"'INPUT DATA ASSUMPTION (1) '!E4*(1+'INPUT DATA ASSUMPTION (2) '!E4)","v":42.705084541462973},{"$f":"'INPUT DATA ASSUMPTION (1) '!F4*(1+'INPUT DATA ASSUMPTION (2) '!F4)","v":376.48083477095196}]
[null,"EOI Costs (operating costs ONLY)",{"$f":"'INPUT DATA ASSUMPTION (1) '!C5*(1+'INPUT DATA ASSUMPTION (2) '!C5)","v":11.213222818088967},{"$f":"'INPUT DATA ASSUMPTION (1) '!D5*(1+'INPUT DATA ASSUMPTION (2) '!D5)","v":62.036579063986295},{"$f":"'INPUT DATA ASSUMPTION (1) '!E5*(1+'INPUT DATA ASSUMPTION (2) '!E5)","v":56.991626897893518},{"$f":"'INPUT DATA ASSUMPTION (1) '!F5*(1+'INPUT DATA ASSUMPTION (2) '!F5)","v":130.24142877996877}]
[null,"WBA Operating costs",{"$f":"'INPUT DATA ASSUMPTION (1) '!C6*(1+'INPUT DATA ASSUMPTION (2) '!C6)","v":40.101882743535853},{"$f":"'INPUT DATA ASSUMPTION (1) '!D6*(1+'INPUT DATA ASSUMPTION (2) '!D6)","v":42.881867956140205},{"$f":"'INPUT DATA ASSUMPTION (1) '!E6*(1+'INPUT DATA ASSUMPTION (2) '!E6)","v":3.441841040236409},{"$f":"'INPUT DATA ASSUMPTION (1) '!F6*(1+'INPUT DATA ASSUMPTION (2) '!F6)","v":86.425591739912463}]
{"$rows_left_out":26}
{"sheet":"INPUT DATA ASSUMPTION (2) ","index":15,"n_rows":50,"n_cols":13,"rows_kept":50,"cut":false,"hidden":false,"merged":[]}
["SHEET TYPE: ","Assumption selection - Market boundary change (Market 1 to Market A)",null,null,null,null,null,null,null,"[\"] "]
[]
[{"$f":"'MAIN SHEET - OUTPUT  '!B6","v":1},null,"BANDWIDTH","RENTALS","EXCLUDED","TOTAL",null,null,"Assumption selection"]
[null,"Revenue",{"$f":"IF($A$3=1,C11,IF($A$3=2,C18,IF($A$3=3,C25,IF($A$3=4,C32,IF($A$3=5,C39,IF($A$3=6,C46,\"ERROR\"))))))","v":-9.2634502501297455E-2},{"$f":"IF($A$3=1,D11,IF($A$3=2,D18,IF($A$3=3,D25,IF($A$3=4,D32,IF($A$3=5,D39,IF($A$3=6,D46,\"ERROR\"))))))","v":-9.2634502501297455E-2},-9.2634502501297455E-2,-9.2634502501297455E-2,null,null,"Mid Costs removed (Costs/Revenue=0.5)"]
[null,"EOI Costs (operating costs ONLY)",{"$f":"IF($A$3=1,C12,IF($A$3=2,C19,IF($A$3=3,C26,IF($A$3=4,C33,IF($A$3=5,C40,IF($A$3=6,C47,\"ERROR\"))))))","v":-9.2634502501297455E-2},-9.2634502501297455E-2,-9.2634502501297455E-2,-9.2634502501297455E-2]
[null,"WBA Operating costs",-4.6317251250648728E-2,-4.6317251250648728E-2,-4.6317251250648728E-2,-4.6317251250648728E-2]
{"$rows_left_out":45}
{"sheet":"INPUT DATA ASSUMPTION (1) ","index":16,"n_rows":50,"n_cols":9,"rows_kept":50,"cut":false,"hidden":false,"merged":[[11,8,14,8],[18,8,20,8],[25,8,27,8],[32,8,35,8]]}
["SHEET TYPE: ","Assumption selection - Adjustments"]
[]
[{"$f":"'MAIN SHEET - OUTPUT  '!B5","v":4},null,"BANDWIDTH","RENTALS","EXCLUDED","TOTAL","CHECK",null,"Assumption selection"]
[null,"Revenue",{"$f":"IF($A$3=1,C11,IF($A$3=2,C18,IF($A$3=3,C25,IF($A$3=4,C32,IF($A$3=5,C39,IF($A$3=6,C46,\"ERROR\"))))))","v":194.00684999999999},{"$f":"IF($A$3=1,D11,IF($A$3=2,D18,IF($A$3=3,D25,IF($A$3=4,D32,IF($A$3=5,D39,IF($A$3=6,D46,\"ERROR\"))))))","v":173.84464},47.064919989999993,414.91640998999998,"ok",null,"2012 RFS with BT's HON + CCA adjustment + DSLAM costs allocated 25% to Bandwidth"]
[null,"EOI Costs (operating costs ONLY)",{"$f":"IF($A$3=1,C12,IF($A$3=2,C19,IF($A$3=3,C26,IF($A$3=4,C33,IF($A$3=5,C40,IF($A$3=6,C47,\"ERROR\"))))))","v":12.358000000000001},{"$f":"IF($A$3=1,D12,IF($A$3=2,D19,IF($A$3=3,D26,IF($A$3=4,D33,IF($A$3=5,D40,IF($A$3=6,D47,\"ERROR\"))))))","v":68.37},62.810000000000009,143.53800000000001,"ok"]
[null,"WBA Operating costs",{"$f":"IF($A$3=1,C13,IF($A$3=2,C20,IF($A$3=3,C27,IF($A$3=4,C34,IF($A$3=5,C41,IF($A$3=6,C48,\"ERROR\"))))))","v":42.049500000000002},44.964499999999994,3.609,90.62299999999999,"ok"]
{"$rows_left_out":45}
{"sheet":"INPUT DATA SUMMARYa","index":17,"n_rows":115,"n_cols":10,"rows_kept":115,"cut":false,"hidden":false,"merged":[]}
["SHEET TYPE: ","BASE YEAR INPUT ASSUMPTION"]
[]
["2012 RFS (Excluding MCE associated with EOI services)"]
[null,"Values"]
["Row Labels","Sum of Revenue","Sum of EOI Costs (operating costs ONLY)","Sum of WBA Operating costs","Sum of WBA Depreciation Costs","Sum of WBA MCE"]
["Bandwidth",194.00684999999999,12.358000000000001,29.528999999999996,40.548000000000009,210.81300000000002]
{"$rows_left_out":110}
{"sheet":"BT_INPUT DATA S135","index":18,"n_rows":534,"n_cols":22,"rows_kept":534,"cut":false,"hidden":false,"merged":[]}
["SHEET TYPE: ","INPUT DATA"]
["SOURCE SPREADSHEET: ","BT's response to our March 2013 s135: 20130405 BT Response Third Tranche A3 A4 by Service existing and updated markets 1 and 2.xlsx"]
["Spreadsheet tab:","ROC existing mkt 1 by service"]
[]
[]
[]
{"$rows_left_out":529}
{"sheet":"BT_LOOK UP TABLE","index":19,"n_rows":104,"n_cols":5,"rows_kept":104,"cut":false,"hidden":false,"merged":[]}
["SHEET TYPE: ","INPUT DATA"]
["Service Code","Serv Mapping","Service Description","EOI","Bandwidth/Rentals/excluded"]
["SM110","Ext Ancillary","Mkt 1 - OR Ext WBA end user access-ceases","EOI","Excluded"]
["SM192","Ext Ancillary","Mkt 1 - OR Ext WBA SMPF enhanced care","EOI","Excluded"]
["SM198","Ext Ancillary","Mkt 1 - OR Ext WBA SMPF Expedite","EOI","Excluded"]
["SM120","Ext Ancillary","Mkt 1 - WH Ext IPst Connect end user access-ceases","WBA","Excluded"]
{"$rows_left_out":99}
{"sheet":"INPUT DATA_OTHER ","index":20,"n_rows":33,"n_cols":7,"rows_kept":33,"cut":false,"hidden":false,"merged":[]}
["SHEET TYPE: ","BASE YEAR INPUT ASSUMPTION"]
[]
["1) Market size adjustment - moving from market 1 to market A"]
["Source of information: xxxxxxxxxxxxxxxxxxxxxxxxxxxxx"]
[]
[null,null,null,"Exchange Count","Average Premises Served","Total Active Circuits","BT Active Circuits"]
{"$rows_left_out":28}
{"sheet":"INPUT DATA_Price List Changes ","index":21,"n_rows":54,"n_cols":20,"rows_kept":54,"cut":false,"hidden":false,"merged":[[11,2,11,4]]}
["SHEET TYPE: ","Price changes in the WBA market source DATA"]
[]
[]
["IPStream price changes as per BT price list",null,null,null,null,null,null,null,null,null,null,null,null,"Ofcom should correct the weighted average bandwidth price over the period 1 April 2013 to 31 March 2014 from £70.61 to £68.55 to take into account the reduction in bandwidth price to £61.30 in July 2013 (Ofcom used £64.05 in error)."]
["(1) EU charges shown for IPStream Max only",null,null,null,null,"PRICE CHANGES",null,"2012/13","2013/14","2014/15","2014/16"]
["(2) Market 3 prices are list price but bespoke discounts available on request",null,null,null,null,"Bandwidth",null,{"$f":"R17","v":-0.17283265018290805},{"$f":"S17","v":-0.26948483352393682},null,{"$f":"U17","v":0}]
{"$rows_left_out":49}
{"sheet":"INPUT DATA_Inflation Forecasts","index":22,"n_rows":54,"n_cols":10,"rows_kept":54,"cut":false,"hidden":false,"merged":[]}
["SHEET TYPE: ","Inflation forecast from treasury and WACC reference table from lease line charge control"]
[]
[]
[]
["RPI - Feb 13 forecasts"]
[null,null,2012,2013,2014,2015,2016,2017,null,"Comments"]
{"$rows_left_out":49}
{"sheet":"WLRLLU Inflation","index":23,"n_rows":39,"n_cols":10,"rows_kept":39,"cut":false,"hidden":false,"merged":[]}
[]
["RPI - forecasts"]
[null,null,2012,2013,2014,2015,2016,2017]
["Dec RPI - May 2013 forecast",null,3.1,3.3,2.9,3.2,3.4,3.6,"12 - actual, the rest - average of new medium term forecasts from Treasury May 13 Forecast (page 23) https://www.gov.uk/government/publications/forecasts-for-the-uk-economy-may-2013"]
["Dec RPI - Feb 2014 forecast",null,3.1,2.7,2.8,3,3.2,3.2,"2012 and 2013 - actual, the rest - average of new medium term forecasts from Treasury Feb 14 Forecast (page 23) https://www.gov.uk/government/uploads/system/uploads/attachment_data/file/283983/201402forecomp.pdf"]
["Mar RPI (May 2013 forecast)",null,3.6,{"$f":"D4/12*3+C4/12*9","v":3.1500000000000004},{"$f":"E4/12*3+D4/12*9","v":3.1999999999999997},{"$f":"F4/12*3+E4/12*9","v":2.9749999999999996},{"$f":"G4/12*3+F4/12*9","v":3.25},{"$f":"H4/12*3+G4/12*9","v":3.4499999999999997},"12- actual, others calculated from Dec RPI"]
{"$rows_left_out":33}